{"text_format":"3","workbook":"xlsx","n_sheets":6,"sheets":["Instructions","Print Sheet","Roster Selection","Assets","Custom Gladiators","Reference"],"not_rendered":{"images":3,"defined_names":34,"comments":2},"read":"whole","date_system":"1900"}

{"sheet":"Instructions","index":0,"n_rows":15,"n_cols":1,"rows_kept":15}
[]
[]
["This sheet is designed to be used with Beasts and Barbarians suppliment, Gladiators of the Dominon, to use this you require a copy of this suppliment, a copy of Beasts and Barbarians Golden Edition, and the Savage Worlds Deluxe core rulebook"]
[]
["Items on a grey background are entered by the user"]
["Items on a blue background are calculated by the roster"]
["Items on a red background are invalid selections, see the comments for guidance"]
[]
["Gladiators are entered on the Roster Selection tab, and you can also specify details about your team and league, Select any assets that are inplay from the Assets tab (except Mercenary's which are added like a regular gladiator).\n\nIf you wish to use your PC, or design your own gladiator, you can do so on the Custom Gladiators tab, NB: Arcane Backgrounds have deliberately been omitted, select the generic AB, and Power Edge place holders"]
[]
["The Print Sheet is designed to output on 2 sheets of A4 paper to provide quick reference during play"]
[]
["As your team progresses, you can award increases to your attributes or skills via the \"Mod\" column on the Roster Selection tab. This will automatically increase the relevant statistic on the Print Sheet tab. Additionally, you can select extra Edges and add more Gear to your fighter through the relevant sections on the Roster Sheet."]
[]
["This game references the Savage Worlds game system, available from Pinnacle Entertainment Group at www.peginc.com. Savage Worlds and all associated logos and trademarks are copyrights of Pinnacle Entertainment\n\nGroup. Used with permission. Pinnacle makes no representation or warranty as to the quality, viability, or suitability for purpose of this product. Some artwork copyright Michael Hammes and Philip Reed, used under license. www.roninarts.com\n\n©2011 Gramel Justyna Koryś, Beasts and Barbarians, Dread Star Dominions and all related marks and logos are trademarks of Gramel Justyna Koryś. All Rights Reserved.\n\nProduced under license by Studio 2 Publishing, Inc. The Studio 2 logo is a trademark of Studio 2 Publishing, Inc. All rights reserved."]
{"$rows_left_out":1}
{"sheet":"Print Sheet","index":1,"n_rows":68,"n_cols":11,"rows_kept":68,"merged":[[0,0,0,2],[0,3,0,6],[0,7,0,10],[1,1,1,5],[1,7,4,10],[2,1,2,5],[3,1,3,5],[4,1,4,5],[5,3,5,5],[5,6,5,7],[5,8,5,10],[8,0,12,0],[8,10,12,10],[9,2,9,9],[10,2,10,9],[11,2,11,9],[12,2,12,9],[13,0,17,0],[13,10,17,10],[14,2,14,9],[15,2,15,9],[16,2,16,9],[17,2,17,9],[18,0,22,0],[18,10,22,10],[19,2,19,9],[20,2,20,9],[21,2,21,9],[22,2,22,9],[23,0,27,0],[23,10,27,10],[24,2,24,9],[25,2,25,9],[26,2,26,9],[27,2,27,9],[28,0,32,0],[28,10,32,10],[29,2,29,9],[30,2,30,9],[31,2,31,9],[32,2,32,9],[33,0,37,0],[33,10,37,10],[34,2,34,9],[35,2,35,9],[36,2,36,9],[37,2,37,9],[38,0,42,0],[38,10,42,10],[39,2,39,9],[40,2,40,9],[41,2,41,9],[42,2,42,9],[43,0,47,0],[43,10,47,10],[44,2,44,9],[45,2,45,9],[46,2,46,9],[47,2,47,9],[48,0,52,0],[48,10,52,10],[49,2,49,9],[50,2,50,9],[51,2,51,9],[52,2,52,9],[53,0,57,0],[53,10,57,10],[54,2,54,9],[55,2,55,9],[56,2,56,9],[57,2,57,9],[58,0,62,0],[58,10,62,10],[59,2,59,9],[60,2,60,9],[61,2,61,9],[62,2,62,9],[63,0,67,0],[63,10,67,10],[64,2,64,9],[65,2,65,9],[66,2,66,9],[67,2,67,9]]}
[]
["Team Name:",{"$f":"IF(RS_Team_Name=\"\",\"\",RS_Team_Name)","v":""},{"$nulls":5},"Season of Blood\nTeam Roster"]
["Player:",{"$f":"IF(RS_Player=\"\",\"\",RS_Player)","v":""}]
["Team Type",{"$f":"IF(RS_Team_Type=\"\",\"\",RS_Team_Type)","v":"Regular"}]
["Team Celebrity:",{"$f":"IF(D6=\"Quick Match\",\"d8\",IF(RS_BaseCelebrity=\"\",\"\",VLOOKUP(VLOOKUP(RS_BaseCelebrity,Info_Die_Types_Data,2,FALSE)+RS_ModCelebrity,Info_Die_Types_Conversion,2,FALSE)))","v":"d8"}]
["Arena Points (Spent/Budget)",{"$f":"RS_Value&\"/\"&RS_Value_Allowed","v":"/50"},"League Type",{"$f":"RS_League_Type","v":"Quick Match"},null,null,"ASSETS",null,{"$f":"IF(Info_Asset_Roster<>\"\",Info_Asset_Roster,\"\")","v":""}]
[]
["Position","Name","Gladiator Role","Type","Cha.","Pace","Parry","Tough.","Injury Status","Cost","Notes"]
[1,{"$f":"HLOOKUP($A9,Info_Roster_Values,MATCH(B$8,Info_Roster_Values_Labels,0),FALSE)","v":""},"","",{"$f":"HLOOKUP($A9,Info_Roster_Values,MATCH(E$8,Info_Roster_Values_Labels,0),FALSE)","v":0},0,0,0,"Uninjured","",{"$f":"HLOOKUP($A9,Info_Roster_Values,MATCH(K$8,Info_Roster_Values_Labels,0),FALSE)","v":""}]
[null,"Attributes",{"$f":"HLOOKUP($A9,Info_Roster_Values,MATCH(B$10,Info_Roster_Values_Labels,0),FALSE)","v":""}]
[null,"Skills",{"$f":"HLOOKUP($A9,Info_Roster_Values,MATCH(B$11,Info_Roster_Values_Labels,0),FALSE)","v":""}]
[null,"Edges",{"$f":"HLOOKUP($A9,Info_Roster_Values,MATCH(B$12,Info_Roster_Values_Labels,0),FALSE)","v":""}]
[null,"Gear",{"$f":"HLOOKUP($A9,Info_Roster_Values,MATCH(B$13,Info_Roster_Values_Labels,0),FALSE)","v":""}]
[2,{"$f":"HLOOKUP($A14,Info_Roster_Values,MATCH(B$8,Info_Roster_Values_Labels,0),FALSE)","v":""},"","",0,0,0,0,"Uninjured","",{"$f":"HLOOKUP($A14,Info_Roster_Values,MATCH(K$8,Info_Roster_Values_Labels,0),FALSE)","v":""}]
[null,"Attributes",{"$f":"HLOOKUP($A14,Info_Roster_Values,MATCH(B$10,Info_Roster_Values_Labels,0),FALSE)","v":""}]
{"$rows_left_out":54}
{"sheet":"Roster Selection","index":2,"n_rows":60,"n_cols":25,"rows_kept":60,"merged":[[0,1,0,9],[1,1,1,9],[2,1,2,3],[2,4,2,6],[2,7,2,9],[3,1,3,2],[3,4,3,5],[3,7,3,8],[4,1,4,2],[4,4,4,5],[4,7,4,8],[4,10,4,11],[4,13,4,14],[6,1,6,2],[6,3,6,4],[6,5,6,6],[6,7,6,8],[6,9,6,10],[6,11,6,12],[6,13,6,14],[6,15,6,16],[6,17,6,18],[6,19,6,20],[6,21,6,22],[6,23,6,24],[8,1,8,2],[8,3,8,4],[8,5,8,6],[8,7,8,8],[8,9,8,10],[8,11,8,12],[8,13,8,14],[8,15,8,16],[8,17,8,18],[8,19,8,20],[8,21,8,22],[8,23,8,24],[9,1,9,2],[9,3,9,4],[9,5,9,6],[9,7,9,8],[9,9,9,10],[9,11,9,12],[9,13,9,14],[9,15,9,16],[9,17,9,18],[9,19,9,20],[9,21,9,22],[9,23,9,24],[10,1,10,2],[10,3,10,4],[10,5,10,6],[10,7,10,8],[10,9,10,10],[10,11,10,12],[10,13,10,14],[10,15,10,16],[10,17,10,18],[10,19,10,20],[10,21,10,22],[10,23,10,24],[11,1,11,2],[11,3,11,4],[11,5,11,6],[11,7,11,8],[11,9,11,10],[11,11,11,12],[11,13,11,14],[11,15,11,16],[11,17,11,18],[11,19,11,20],[11,21,11,22],[11,23,11,24],[12,1,12,2],[12,3,12,4],[12,5,12,6],[12,7,12,8],[12,9,12,10],[12,11,12,12],[12,13,12,14],[12,15,12,16],[12,17,12,18],[12,19,12,20],[12,21,12,22],[12,23,12,24],[13,1,13,2],[13,3,13,4],[13,5,13,6],[13,7,13,8],[13,9,13,10],[13,11,13,12],[13,13,13,14],[13,15,13,16],[13,17,13,18],[13,19,13,20],[13,21,13,22],[13,23,13,24],[14,1,14,2],[14,3,14,4],[14,5,14,6],[14,7,14,8],[14,9,14,10],[14,11,14,12],[14,13,14,14],[14,15,14,16],[14,17,14,18],[14,19,14,20],[14,21,14,22],[14,23,14,24],[17,1,17,2],[17,3,17,4],[17,5,17,6],[17,7,17,8],[17,9,17,10],[17,11,17,12],[17,13,17,14],[17,15,17,16],[17,17,17,18],[17,19,17,20],[17,21,17,22],[17,23,17,24],[49,1,49,2],[49,3,49,4],[49,5,49,6],[49,7,49,8],[49,9,49,10],[49,11,49,12],[49,13,49,14],[49,15,49,16],[49,17,49,18],[49,19,49,20],[49,21,49,22],[49,23,49,24],[50,1,50,2],[50,3,50,4],[50,5,50,6],[50,7,50,8],[50,9,50,10],[50,11,50,12],[50,13,50,14],[50,15,50,16],[50,17,50,18],[50,19,50,20],[50,21,50,22],[50,23,50,24],[51,1,51,2],[51,3,51,4],[51,5,51,6],[51,7,51,8],[51,9,51,10],[51,11,51,12],[51,13,51,14],[51,15,51,16],[51,17,51,18],[51,19,51,20],[51,21,51,22],[51,23,51,24],[52,1,52,2],[52,3,52,4],[52,5,52,6],[52,7,52,8],[52,9,52,10],[52,11,52,12],[52,13,52,14],[52,15,52,16],[52,17,52,18],[52,19,52,20],[52,21,52,22],[52,23,52,24],[53,1,53,2],[53,3,53,4],[53,5,53,6],[53,7,53,8],[53,9,53,10],[53,11,53,12],[53,13,53,14],[53,15,53,16],[53,17,53,18],[53,19,53,20],[53,21,53,22],[53,23,53,24],[54,1,54,2],[54,3,54,4],[54,5,54,6],[54,7,54,8],[54,9,54,10],[54,11,54,12],[54,13,54,14],[54,15,54,16],[54,17,54,18],[54,19,54,20],[54,21,54,22],[54,23,54,24],[55,1,55,2],[55,3,55,4],[55,5,55,6],[55,7,55,8],[55,9,55,10],[55,11,55,12],[55,13,55,14],[55,15,55,16],[55,17,55,18],[55,19,55,20],[55,21,55,22],[55,23,55,24],[56,1,56,2],[56,3,56,4],[56,5,56,6],[56,7,56,8],[56,9,56,10],[56,11,56,12],[56,13,56,14],[56,15,56,16],[56,17,56,18],[56,19,56,20],[56,21,56,22],[56,23,56,24],[57,1,57,2],[57,3,57,4],[57,5,57,6],[57,7,57,8],[57,9,57,10],[57,11,57,12],[57,13,57,14],[57,15,57,16],[57,17,57,18],[57,19,57,20],[57,21,57,22],[57,23,57,24],[58,1,58,2],[58,3,58,4],[58,5,58,6],[58,7,58,8],[58,9,58,10],[58,11,58,12],[58,13,58,14],[58,15,58,16],[58,17,58,18],[58,19,58,20],[58,21,58,22],[58,23,58,24],[59,1,59,2],[59,3,59,4],[59,5,59,6],[59,7,59,8],[59,9,59,10],[59,11,59,12],[59,13,59,14],[59,15,59,16],[59,17,59,18],[59,19,59,20],[59,21,59,22],[59,23,59,24]]}
["Team Name:"]
["Player:"]
["Team Type","Regular",null,null,"League Type",null,null,"Quick Match"]
["Team Celebrity:","Start",null,"d4-2","MidSeason",null,null,"Cost",null,{"$f":"IF(RS_BaseCelebrity=\"\",0,IF(RS_League=\"Quick Match\",0,VLOOKUP(D4,Info_Die_Types_Data,2,FALSE)*VLOOKUP(RS_League,Info_League_Data,7,FALSE)+(G4*2*VLOOKUP(RS_League,Info_League_Data,7,FALSE))))","v":0}]
["Arena Points","Allowed",null,{"$f":"VLOOKUP(RS_League,Info_League_Data,2,FALSE)","v":50},"Spent",null,{"$f":"SUM(RS_Value,RS_CelebrityCost)-SUMIF(B12:Y12,\"Y\",RS_Value)","v":0},"Assets Spend",null,{"$f":"SUM(Assets_Arena_Points_Spent)","v":0},"Remaining",null,{"$f":"D5-G5-J5+P5","v":50},"Earnt"]
[]
["Position",1,null,2,null,3,null,4,null,5,null,6,null,7,null,8,null,9,null,10,null,11,null,12]
["Gladiators","Base","Mod","Base","Mod","Base","Mod","Base","Mod","Base","Mod","Base","Mod","Base","Mod","Base","Mod","Base","Mod","Base","Mod","Base","Mod","Base","Mod"]
["Name"]
["Gladiator Role"]
["Type"]
["Mercenary","N",null,"N",null,"N",null,"N",null,"N",null,"N",null,"N",null,"N",null,"N",null,"N",null,"N",null,"N"]
["Tricarnian",{"$f":"IF(B10=\"\",\"\",VLOOKUP(B10,Info_Gladiator_Data,2,FALSE))","v":""},null,{"$f":"IF(D10=\"\",\"\",VLOOKUP(D10,Info_Gladiator_Data,2,FALSE))","v":""},null,{"$f":"IF(F10=\"\",\"\",VLOOKUP(F10,Info_Gladiator_Data,2,FALSE))","v":""},null,{"$f":"IF(H10=\"\",\"\",VLOOKUP(H10,Info_Gladiator_Data,2,FALSE))","v":""},null,{"$f":"IF(J10=\"\",\"\",VLOOKUP(J10,Info_Gladiator_Data,2,FALSE))","v":""},null,{"$f":"IF(L10=\"\",\"\",VLOOKUP(L10,Info_Gladiator_Data,2,FALSE))","v":""},null,{"$f":"IF(N10=\"\",\"\",VLOOKUP(N10,Info_Gladiator_Data,2,FALSE))","v":""},null,{"$f":"IF(P10=\"\",\"\",VLOOKUP(P10,Info_Gladiator_Data,2,FALSE))","v":""},null,{"$f":"IF(R10=\"\",\"\",VLOOKUP(R10,Info_Gladiator_Data,2,FALSE))","v":""},null,{"$f":"IF(T10=\"\",\"\",VLOOKUP(T10,Info_Gladiator_Data,2,FALSE))","v":""},null,{"$f":"IF(V10=\"\",\"\",VLOOKUP(V10,Info_Gladiator_Data,2,FALSE))","v":""},null,{"$f":"IF(X10=\"\",\"\",VLOOKUP(X10,Info_Gladiator_Data,2,FALSE))","v":""}]
["Value",{"$f":"IF(AND(B10<>\"\",B11<>\"\"),IF(B12=\"Y\",ROUNDUP(VLOOKUP(B10,Info_Gladiator_Data,VLOOKUP(B11,Info_Type_Data,2,FALSE),FALSE)*0.5,0),VLOOKUP(B10,Info_Gladiator_Data,VLOOKUP(B11,Info_Type_Data,2,FALSE),FALSE)),\"\")","v":""},null,{"$f":"IF(AND(D10<>\"\",D11<>\"\"),IF(D12=\"Y\",ROUNDUP(VLOOKUP(D10,Info_Gladiator_Data,VLOOKUP(D11,Info_Type_Data,2,FALSE),FALSE)*0.5,0),VLOOKUP(D10,Info_Gladiator_Data,VLOOKUP(D11,Info_Type_Data,2,FALSE),FALSE)),\"\")","v":""},null,{"$f":"IF(AND(F10<>\"\",F11<>\"\"),IF(F12=\"Y\",ROUNDUP(VLOOKUP(F10,Info_Gladiator_Data,VLOOKUP(F11,Info_Type_Data,2,FALSE),FALSE)*0.5,0),VLOOKUP(F10,Info_Gladiator_Data,VLOOKUP(F11,Info_Type_Data,2,FALSE),FALSE)),\"\")","v":""},null,{"$f":"IF(AND(H10<>\"\",H11<>\"\"),IF(H12=\"Y\",ROUNDUP(VLOOKUP(H10,Info_Gladiator_Data,VLOOKUP(H11,Info_Type_Data,2,FALSE),FALSE)*0.5,0),VLOOKUP(H10,Info_Gladiator_Data,VLOOKUP(H11,Info_Type_Data,2,FALSE),FALSE)),\"\")","v":""},null,{"$f":"IF(AND(J10<>\"\",J11<>\"\"),IF(J12=\"Y\",ROUNDUP(VLOOKUP(J10,Info_Gladiator_Data,VLOOKUP(J11,Info_Type_Data,2,FALSE),FALSE)*0.5,0),VLOOKUP(J10,Info_Gladiator_Data,VLOOKUP(J11,Info_Type_Data,2,FALSE),FALSE)),\"\")","v":""},null,{"$f":"IF(AND(L10<>\"\",L11<>\"\"),IF(L12=\"Y\",ROUNDUP(VLOOKUP(L10,Info_Gladiator_Data,VLOOKUP(L11,Info_Type_Data,2,FALSE),FALSE)*0.5,0),VLOOKUP(L10,Info_Gladiator_Data,VLOOKUP(L11,Info_Type_Data,2,FALSE),FALSE)),\"\")","v":""},null,{"$f":"IF(AND(N10<>\"\",N11<>\"\"),IF(N12=\"Y\",ROUNDUP(VLOOKUP(N10,Info_Gladiator_Data,VLOOKUP(N11,Info_Type_Data,2,FALSE),FALSE)*0.5,0),VLOOKUP(N10,Info_Gladiator_Data,VLOOKUP(N11,Info_Type_Data,2,FALSE),FALSE)),\"\")","v":""},null,{"$f":"IF(AND(P10<>\"\",P11<>\"\"),IF(P12=\"Y\",ROUNDUP(VLOOKUP(P10,Info_Gladiator_Data,VLOOKUP(P11,Info_Type_Data,2,FALSE),FALSE)*0.5,0),VLOOKUP(P10,Info_Gladiator_Data,VLOOKUP(P11,Info_Type_Data,2,FALSE),FALSE)),\"\")","v":""},null,{"$f":"IF(AND(R10<>\"\",R11<>\"\"),IF(R12=\"Y\",ROUNDUP(VLOOKUP(R10,Info_Gladiator_Data,VLOOKUP(R11,Info_Type_Data,2,FALSE),FALSE)*0.5,0),VLOOKUP(R10,Info_Gladiator_Data,VLOOKUP(R11,Info_Type_Data,2,FALSE),FALSE)),\"\")","v":""},null,{"$f":"IF(AND(T10<>\"\",T11<>\"\"),IF(T12=\"Y\",ROUNDUP(VLOOKUP(T10,Info_Gladiator_Data,VLOOKUP(T11,Info_Type_Data,2,FALSE),FALSE)*0.5,0),VLOOKUP(T10,Info_Gladiator_Data,VLOOKUP(T11,Info_Type_Data,2,FALSE),FALSE)),\"\")","v":""},null,{"$f":"IF(AND(V10<>\"\",V11<>\"\"),IF(V12=\"Y\",ROUNDUP(VLOOKUP(V10,Info_Gladiator_Data,VLOOKUP(V11,Info_Type_Data,2,FALSE),FALSE)*0.5,0),VLOOKUP(V10,Info_Gladiator_Data,VLOOKUP(V11,Info_Type_Data,2,FALSE),FALSE)),\"\")","v":""},null,{"$f":"IF(AND(X10<>\"\",X11<>\"\"),IF(X12=\"Y\",ROUNDUP(VLOOKUP(X10,Info_Gladiator_Data,VLOOKUP(X11,Info_Type_Data,2,FALSE),FALSE)*0.5,0),VLOOKUP(X10,Info_Gladiator_Data,VLOOKUP(X11,Info_Type_Data,2,FALSE),FALSE)),\"\")","v":""}]
["Wounds",{"$f":"IF(B11=\"\",\"\",VLOOKUP(B11,Info_Type_Data,3,FALSE))","v":""},null,{"$f":"IF(D11=\"\",\"\",VLOOKUP(D11,Info_Type_Data,3,FALSE))","v":""},null,{"$f":"IF(F11=\"\",\"\",VLOOKUP(F11,Info_Type_Data,3,FALSE))","v":""},null,{"$f":"IF(H11=\"\",\"\",VLOOKUP(H11,Info_Type_Data,3,FALSE))","v":""},null,{"$f":"IF(J11=\"\",\"\",VLOOKUP(J11,Info_Type_Data,3,FALSE))","v":""},null,{"$f":"IF(L11=\"\",\"\",VLOOKUP(L11,Info_Type_Data,3,FALSE))","v":""},null,{"$f":"IF(N11=\"\",\"\",VLOOKUP(N11,Info_Type_Data,3,FALSE))","v":""},null,{"$f":"IF(P11=\"\",\"\",VLOOKUP(P11,Info_Type_Data,3,FALSE))","v":""},null,{"$f":"IF(R11=\"\",\"\",VLOOKUP(R11,Info_Type_Data,3,FALSE))","v":""},null,{"$f":"IF(T11=\"\",\"\",VLOOKUP(T11,Info_Type_Data,3,FALSE))","v":""},null,{"$f":"IF(V11=\"\",\"\",VLOOKUP(V11,Info_Type_Data,3,FALSE))","v":""},null,{"$f":"IF(X11=\"\",\"\",VLOOKUP(X11,Info_Type_Data,3,FALSE))","v":""}]
{"$rows_left_out":46}
{"sheet":"Assets","index":3,"n_rows":16,"n_cols":6,"rows_kept":16}
["Assets","Max","Cost Per Unit","Purchased","Arena Points Spent","Notes"]
["Agitator",{"$f":"VLOOKUP(A2,Info_Asset_Data,2,FALSE)","v":5},{"$f":"VLOOKUP(A2,Info_Asset_Data,6,FALSE)","v":1},null,{"$f":"IF(OR(D2=\"\",D2=0),\"\",D2*(D2+1)/2)","v":""},{"$f":"IF(VLOOKUP(A2,Info_Asset_Data,4,FALSE)=\"\",\"\",VLOOKUP(A2,Info_Asset_Data,4,FALSE))","v":"Hostile Asset"}]
["Augur",1,1,null,{"$f":"IF(OR(D3=0,D3=\"\"),\"\",VLOOKUP(A3,Info_Asset_Data,3,FALSE)*Assets!D3)","v":""},"Single use"]
["Assassin",1,1,null,{"$f":"IF(OR(D4=0,D4=\"\"),\"\",VLOOKUP(A4,Info_Asset_Data,3,FALSE)*Assets!D4)","v":""},"Hostile Asset"]
["Courtesan",2,2,null,{"$f":"IF(OR(D5=0,D5=\"\"),\"\",VLOOKUP(A5,Info_Asset_Data,3,FALSE)*Assets!D5)","v":""},"Hostile Asset"]
["Excellent Weapon/Armor",2,2,null,{"$f":"IF(OR(D6=0,D6=\"\"),\"\",VLOOKUP(A6,Info_Asset_Data,3,FALSE)*Assets!D6)","v":""},"Item"]
["Guard",5,5,null,{"$f":"IF(OR(D7=0,D7=\"\"),\"\",VLOOKUP(A7,Info_Asset_Data,3,FALSE)*Assets!D7)","v":""},""]
["Guard Captain",1,1,null,{"$f":"IF(OR(D8=0,D8=\"\"),\"\",VLOOKUP(A8,Info_Asset_Data,3,FALSE)*Assets!D8)","v":""},""]
["Healer",2,2,null,{"$f":"IF(OR(D9=0,D9=\"\"),\"\",VLOOKUP(A9,Info_Asset_Data,3,FALSE)*Assets!D9)","v":""},""]
["Lanista",2,2,null,{"$f":"IF(OR(D10=0,D10=\"\"),\"\",VLOOKUP(A10,Info_Asset_Data,3,FALSE)*Assets!D10)","v":""},""]
["Lotusmaster",1,1,null,{"$f":"IF(OR(D11=0,D11=\"\"),\"\",VLOOKUP(A11,Info_Asset_Data,3,FALSE)*Assets!D11)","v":""},""]
["Match-Fixer",2,2,null,{"$f":"IF(OR(D12=0,D12=\"\"),\"\",VLOOKUP(A12,Info_Asset_Data,3,FALSE)*Assets!D12)","v":""},"Single use"]
["Poisoner",1,3,null,{"$f":"IF(OR(D13=0,D13=\"\"),\"\",VLOOKUP(A13,Info_Asset_Data,3,FALSE)*Assets!D13)","v":""},"Hostile Asset"]
["Spy",1,2,null,{"$f":"IF(OR(D14=0,D14=\"\"),\"\",VLOOKUP(A14,Info_Asset_Data,3,FALSE)*Assets!D14)","v":""},"Hostile Asset"]
["Warlock",1,4,null,{"$f":"IF(OR(D15=0,D15=\"\"),\"\",VLOOKUP(A15,Info_Asset_Data,3,FALSE)*Assets!D15)","v":""},"Hostile Asset"]
{"$rows_left_out":2}
{"sheet":"Custom Gladiators","index":4,"n_rows":49,"n_cols":7,"rows_kept":49}
["Default","Custom_Gladiator_1","Custom_Gladiator_2","Custom_Gladiator_3","Custom_Gladiator_4","Custom_Gladiator_5","Custom_Gladiator_6"]
["Tricarnian","N","N","N","N","N","N"]
["Combat Value",{"$f":"(((IF(B4<>\"\",VLOOKUP(B4,Info_Die_Types_Data,4,FALSE))+IF(B8<>\"\",VLOOKUP(B8,Info_Die_Types_Data,4,FALSE)))/2)+(B13+B14)+MAX(IF(B17<>\"\",VLOOKUP(B17,Info_Die_Types_Data,4,FALSE),0),IF(B22<>\"\",VLOOKUP(B22,Info_Die_Types_Data,4,FALSE),0),IF(B25<>\"\",VLOOKUP(B25,Info_Die_Types_Data,4,FALSE),0))+(((8-COUNTBLANK(B40:B47))+B48)*3))","v":0},0,0,0,0,0]
["Weapon Die"]
["Agility"]
["Smarts"]
["Spirit"]
["Strength"]
["Vigor"]
["Charisma"]
["Pace"]
["Parry"]
["Base Toughness"]
["Armour"]
["Toughness"]
{"$rows_left_out":35}
{"sheet":"Reference","index":5,"n_rows":279,"n_cols":59,"rows_kept":279,"hidden":true}
["Type","Column","Wounds","Bennies","Wild Die","Multiplier","Injury Status","Die Types","Level","Lookup","Max","League Type","Area Points","Duration","RH","HC","WC","Celebrity",null,"Edges"]
["Extra",4,1,0,"N",1,"Dead","d4-2",0,{"$f":"H2","v":"d4-2"},2,"Quick Match",50,"Single battle","any","any",1,"d8"]
["Right-Hand",5,1,0,"Y",1.5,"Niggling Injury","d4",1,{"$f":"H3","v":"d4"},4,"Short League ",60,"4 Weeks long",2,2,2,2]
["Henchman",6,3,0,"N",2,"Wounded","d6",2,"d6",6,"Medium League",70,"8 Weeks long",3,3,2,3]
["Wild Card",7,3,1,"Y",3,"Uninjured","d8",3,"d8",8,"Long League",80,"12 Weeks long",4,4,3,4]
[{"$nulls":7},"d10",4,"d10",10]
[{"$nulls":7},"d12",5,"d12",12]
[{"$nulls":7},"d12+1",6,"d12+1",13]
[{"$nulls":7},"d12+2",7,"d12+2",14]
[{"$nulls":7},"d12+3",8,"d12+3",15]
["True / False","Team Type"]
["N","Regular"]
["Y","Tricarnian"]
[]
[]
{"$rows_left_out":264}