{"text_format":"3","workbook":"xlsx","n_sheets":6,"sheets":["Instructions","Print Sheet","Roster Selection","Assets","Custom Gladiators","Reference"],"not_rendered":{"images":3,"defined_names":34,"comments":2},"read":"whole","date_system":"1900"}

{"sheet":"Instructions","index":0,"n_rows":15,"n_cols":1,"rows_kept":15}
[]
[]
["This sheet is designed to be used with Beasts and Barbarians suppliment, Gladiators of the Dominon, to use this you require a copy of this suppliment, a copy of Beasts and Barbarians Golden Edition, and the Savage Worlds Deluxe core rulebook"]
[]
["Items on a grey background are entered by the user"]
["Items on a blue background are calculated by the roster"]
["Items on a red background are invalid selections, see the comments for guidance"]
[]
["Gladiators are entered on the Roster Selection tab, and you can also specify details about your team and league, Select any assets that are inplay from the Assets tab (except Mercenary's which are added like a regular gladiator).\n\nIf you wish to use your PC, or design your own gladiator, you can do so on the Custom Gladiators tab, NB: Arcane Backgrounds have deliberately been omitted, select the generic AB, and Power Edge place holders"]
[]
["The Print Sheet is designed to output on 2 sheets of A4 paper to provide quick reference during play"]
[]
["As your team progresses, you can award increases to your attributes or skills via the \"Mod\" column on the Roster Selection tab. This will automatically increase the relevant statistic on the Print Sheet tab. Additionally, you can select extra Edges and add more Gear to your fighter through the relevant sections on the Roster Sheet."]
[]
["This game references the Savage Worlds game system, available from Pinnacle Entertainment Group at www.peginc.com. Savage Worlds and all associated logos and trademarks are copyrights of Pinnacle Entertainment\n\nGroup. Used with permission. Pinnacle makes no representation or warranty as to the quality, viability, or suitability for purpose of this product. Some artwork copyright Michael Hammes and Philip Reed, used under license. www.roninarts.com\n\n©2011 Gramel Justyna Koryś, Beasts and Barbarians, Dread Star Dominions and all related marks and logos are trademarks of Gramel Justyna Koryś. All Rights Reserved.\n\nProduced under license by Studio 2 Publishing, Inc. The Studio 2 logo is a trademark of Studio 2 Publishing, Inc. All rights reserved."]

{"sheet":"Print Sheet","index":1,"n_rows":68,"n_cols":11,"rows_kept":68,"merged":[[0,0,0,2],[0,3,0,6],[0,7,0,10],[1,1,1,5],[1,7,4,10],[2,1,2,5],[3,1,3,5],[4,1,4,5],[5,3,5,5],[5,6,5,7],[5,8,5,10],[8,0,12,0],[8,10,12,10],[9,2,9,9],[10,2,10,9],[11,2,11,9],[12,2,12,9],[13,0,17,0],[13,10,17,10],[14,2,14,9],[15,2,15,9],[16,2,16,9],[17,2,17,9],[18,0,22,0],[18,10,22,10],[19,2,19,9],[20,2,20,9],[21,2,21,9],[22,2,22,9],[23,0,27,0],[23,10,27,10],[24,2,24,9],[25,2,25,9],[26,2,26,9],[27,2,27,9],[28,0,32,0],[28,10,32,10],[29,2,29,9],[30,2,30,9],[31,2,31,9],[32,2,32,9],[33,0,37,0],[33,10,37,10],[34,2,34,9],[35,2,35,9],[36,2,36,9],[37,2,37,9],[38,0,42,0],[38,10,42,10],[39,2,39,9],[40,2,40,9],[41,2,41,9],[42,2,42,9],[43,0,47,0],[43,10,47,10],[44,2,44,9],[45,2,45,9],[46,2,46,9],[47,2,47,9],[48,0,52,0],[48,10,52,10],[49,2,49,9],[50,2,50,9],[51,2,51,9],[52,2,52,9],[53,0,57,0],[53,10,57,10],[54,2,54,9],[55,2,55,9],[56,2,56,9],[57,2,57,9],[58,0,62,0],[58,10,62,10],[59,2,59,9],[60,2,60,9],[61,2,61,9],[62,2,62,9],[63,0,67,0],[63,10,67,10],[64,2,64,9],[65,2,65,9],[66,2,66,9],[67,2,67,9]]}
[]
["Team Name:",{"$f":"IF(RS_Team_Name=\"\",\"\",RS_Team_Name)","v":""},{"$nulls":5},"Season of Blood\nTeam Roster"]
["Player:",{"$f":"IF(RS_Player=\"\",\"\",RS_Player)","v":""}]
["Team Type",{"$f":"IF(RS_Team_Type=\"\",\"\",RS_Team_Type)","v":"Regular"}]
["Team Celebrity:",{"$f":"IF(D6=\"Quick Match\",\"d8\",IF(RS_BaseCelebrity=\"\",\"\",VLOOKUP(VLOOKUP(RS_BaseCelebrity,Info_Die_Types_Data,2,FALSE)+RS_ModCelebrity,Info_Die_Types_Conversion,2,FALSE)))","v":"d8"}]
["Arena Points (Spent/Budget)",{"$f":"RS_Value&\"/\"&RS_Value_Allowed","v":"/50"},"League Type",{"$f":"RS_League_Type","v":"Quick Match"},null,null,"ASSETS",null,{"$f":"IF(Info_Asset_Roster<>\"\",Info_Asset_Roster,\"\")","v":""}]
[]
["Position","Name","Gladiator Role","Type","Cha.","Pace","Parry","Tough.","Injury Status","Cost","Notes"]
[1,{"$f":"HLOOKUP($A9,Info_Roster_Values,MATCH(B$8,Info_Roster_Values_Labels,0),FALSE)","v":""},"","",{"$f":"HLOOKUP($A9,Info_Roster_Values,MATCH(E$8,Info_Roster_Values_Labels,0),FALSE)","v":0},0,0,0,"Uninjured","",{"$f":"HLOOKUP($A9,Info_Roster_Values,MATCH(K$8,Info_Roster_Values_Labels,0),FALSE)","v":""}]
[null,"Attributes",{"$f":"HLOOKUP($A9,Info_Roster_Values,MATCH(B$10,Info_Roster_Values_Labels,0),FALSE)","v":""}]
[null,"Skills",{"$f":"HLOOKUP($A9,Info_Roster_Values,MATCH(B$11,Info_Roster_Values_Labels,0),FALSE)","v":""}]
[null,"Edges",{"$f":"HLOOKUP($A9,Info_Roster_Values,MATCH(B$12,Info_Roster_Values_Labels,0),FALSE)","v":""}]
[null,"Gear",{"$f":"HLOOKUP($A9,Info_Roster_Values,MATCH(B$13,Info_Roster_Values_Labels,0),FALSE)","v":""}]
[2,{"$f":"HLOOKUP($A14,Info_Roster_Values,MATCH(B$8,Info_Roster_Values_Labels,0),FALSE)","v":""},"","",0,0,0,0,"Uninjured","",{"$f":"HLOOKUP($A14,Info_Roster_Values,MATCH(K$8,Info_Roster_Values_Labels,0),FALSE)","v":""}]
[null,"Attributes",{"$f":"HLOOKUP($A14,Info_Roster_Values,MATCH(B$10,Info_Roster_Values_Labels,0),FALSE)","v":""}]
[null,"Skills",{"$f":"HLOOKUP($A14,Info_Roster_Values,MATCH(B$11,Info_Roster_Values_Labels,0),FALSE)","v":""}]
[null,"Edges",{"$f":"HLOOKUP($A14,Info_Roster_Values,MATCH(B$12,Info_Roster_Values_Labels,0),FALSE)","v":""}]
[null,"Gear",{"$f":"HLOOKUP($A14,Info_Roster_Values,MATCH(B$13,Info_Roster_Values_Labels,0),FALSE)","v":""}]
[3,{"$f":"HLOOKUP($A19,Info_Roster_Values,MATCH(B$8,Info_Roster_Values_Labels,0),FALSE)","v":""},"","",0,0,0,0,"Uninjured","",{"$f":"HLOOKUP($A19,Info_Roster_Values,MATCH(K$8,Info_Roster_Values_Labels,0),FALSE)","v":""}]
[null,"Attributes",{"$f":"HLOOKUP($A19,Info_Roster_Values,MATCH(B$10,Info_Roster_Values_Labels,0),FALSE)","v":""}]
[null,"Skills",{"$f":"HLOOKUP($A19,Info_Roster_Values,MATCH(B$11,Info_Roster_Values_Labels,0),FALSE)","v":""}]
[null,"Edges",{"$f":"HLOOKUP($A19,Info_Roster_Values,MATCH(B$12,Info_Roster_Values_Labels,0),FALSE)","v":""}]
[null,"Gear",{"$f":"HLOOKUP($A19,Info_Roster_Values,MATCH(B$13,Info_Roster_Values_Labels,0),FALSE)","v":""}]
[4,{"$f":"HLOOKUP($A24,Info_Roster_Values,MATCH(B$8,Info_Roster_Values_Labels,0),FALSE)","v":""},"","",0,0,0,0,"Uninjured","",{"$f":"HLOOKUP($A24,Info_Roster_Values,MATCH(K$8,Info_Roster_Values_Labels,0),FALSE)","v":""}]
[null,"Attributes",{"$f":"HLOOKUP($A24,Info_Roster_Values,MATCH(B$10,Info_Roster_Values_Labels,0),FALSE)","v":""}]
[null,"Skills",{"$f":"HLOOKUP($A24,Info_Roster_Values,MATCH(B$11,Info_Roster_Values_Labels,0),FALSE)","v":""}]
[null,"Edges",{"$f":"HLOOKUP($A24,Info_Roster_Values,MATCH(B$12,Info_Roster_Values_Labels,0),FALSE)","v":""}]
[null,"Gear",{"$f":"HLOOKUP($A24,Info_Roster_Values,MATCH(B$13,Info_Roster_Values_Labels,0),FALSE)","v":""}]
[5,{"$f":"HLOOKUP($A29,Info_Roster_Values,MATCH(B$8,Info_Roster_Values_Labels,0),FALSE)","v":""},"","",0,0,0,0,"Uninjured","",{"$f":"HLOOKUP($A29,Info_Roster_Values,MATCH(K$8,Info_Roster_Values_Labels,0),FALSE)","v":""}]
[null,"Attributes",{"$f":"HLOOKUP($A29,Info_Roster_Values,MATCH(B$10,Info_Roster_Values_Labels,0),FALSE)","v":""}]
[null,"Skills",{"$f":"HLOOKUP($A29,Info_Roster_Values,MATCH(B$11,Info_Roster_Values_Labels,0),FALSE)","v":""}]
[null,"Edges",{"$f":"HLOOKUP($A29,Info_Roster_Values,MATCH(B$12,Info_Roster_Values_Labels,0),FALSE)","v":""}]
[null,"Gear",{"$f":"HLOOKUP($A29,Info_Roster_Values,MATCH(B$13,Info_Roster_Values_Labels,0),FALSE)","v":""}]
[6,{"$f":"HLOOKUP($A34,Info_Roster_Values,MATCH(B$8,Info_Roster_Values_Labels,0),FALSE)","v":""},"","",0,0,0,0,"Uninjured","",{"$f":"HLOOKUP($A34,Info_Roster_Values,MATCH(K$8,Info_Roster_Values_Labels,0),FALSE)","v":""}]
[null,"Attributes",{"$f":"HLOOKUP($A34,Info_Roster_Values,MATCH(B$10,Info_Roster_Values_Labels,0),FALSE)","v":""}]
[null,"Skills",{"$f":"HLOOKUP($A34,Info_Roster_Values,MATCH(B$11,Info_Roster_Values_Labels,0),FALSE)","v":""}]
[null,"Edges",{"$f":"HLOOKUP($A34,Info_Roster_Values,MATCH(B$12,Info_Roster_Values_Labels,0),FALSE)","v":""}]
[null,"Gear",{"$f":"HLOOKUP($A34,Info_Roster_Values,MATCH(B$13,Info_Roster_Values_Labels,0),FALSE)","v":""}]
[7,{"$f":"HLOOKUP($A39,Info_Roster_Values,MATCH(B$8,Info_Roster_Values_Labels,0),FALSE)","v":""},"","",0,0,0,0,"Uninjured","",{"$f":"HLOOKUP($A39,Info_Roster_Values,MATCH(K$8,Info_Roster_Values_Labels,0),FALSE)","v":""}]
[null,"Attributes",{"$f":"HLOOKUP($A39,Info_Roster_Values,MATCH(B$10,Info_Roster_Values_Labels,0),FALSE)","v":""}]
[null,"Skills",{"$f":"HLOOKUP($A39,Info_Roster_Values,MATCH(B$11,Info_Roster_Values_Labels,0),FALSE)","v":""}]
[null,"Edges",{"$f":"HLOOKUP($A39,Info_Roster_Values,MATCH(B$12,Info_Roster_Values_Labels,0),FALSE)","v":""}]
[null,"Gear",{"$f":"HLOOKUP($A39,Info_Roster_Values,MATCH(B$13,Info_Roster_Values_Labels,0),FALSE)","v":""}]
[8,{"$f":"HLOOKUP($A44,Info_Roster_Values,MATCH(B$8,Info_Roster_Values_Labels,0),FALSE)","v":""},"","",0,0,0,0,"Uninjured","",{"$f":"HLOOKUP($A44,Info_Roster_Values,MATCH(K$8,Info_Roster_Values_Labels,0),FALSE)","v":""}]
[null,"Attributes",{"$f":"HLOOKUP($A44,Info_Roster_Values,MATCH(B$10,Info_Roster_Values_Labels,0),FALSE)","v":""}]
[null,"Skills",{"$f":"HLOOKUP($A44,Info_Roster_Values,MATCH(B$11,Info_Roster_Values_Labels,0),FALSE)","v":""}]
[null,"Edges",{"$f":"HLOOKUP($A44,Info_Roster_Values,MATCH(B$12,Info_Roster_Values_Labels,0),FALSE)","v":""}]
[null,"Gear",{"$f":"HLOOKUP($A44,Info_Roster_Values,MATCH(B$13,Info_Roster_Values_Labels,0),FALSE)","v":""}]
[9,{"$f":"HLOOKUP($A49,Info_Roster_Values,MATCH(B$8,Info_Roster_Values_Labels,0),FALSE)","v":""},"","",0,0,0,0,"Uninjured","",{"$f":"HLOOKUP($A49,Info_Roster_Values,MATCH(K$8,Info_Roster_Values_Labels,0),FALSE)","v":""}]
[null,"Attributes",{"$f":"HLOOKUP($A49,Info_Roster_Values,MATCH(B$10,Info_Roster_Values_Labels,0),FALSE)","v":""}]
[null,"Skills",{"$f":"HLOOKUP($A49,Info_Roster_Values,MATCH(B$11,Info_Roster_Values_Labels,0),FALSE)","v":""}]
[null,"Edges",{"$f":"HLOOKUP($A49,Info_Roster_Values,MATCH(B$12,Info_Roster_Values_Labels,0),FALSE)","v":""}]
[null,"Gear",{"$f":"HLOOKUP($A49,Info_Roster_Values,MATCH(B$13,Info_Roster_Values_Labels,0),FALSE)","v":""}]
[10,{"$f":"HLOOKUP($A54,Info_Roster_Values,MATCH(B$8,Info_Roster_Values_Labels,0),FALSE)","v":""},"","",0,0,0,0,"Uninjured","",{"$f":"HLOOKUP($A54,Info_Roster_Values,MATCH(K$8,Info_Roster_Values_Labels,0),FALSE)","v":""}]
[null,"Attributes",{"$f":"HLOOKUP($A54,Info_Roster_Values,MATCH(B$10,Info_Roster_Values_Labels,0),FALSE)","v":""}]
[null,"Skills",{"$f":"HLOOKUP($A54,Info_Roster_Values,MATCH(B$11,Info_Roster_Values_Labels,0),FALSE)","v":""}]
[null,"Edges",{"$f":"HLOOKUP($A54,Info_Roster_Values,MATCH(B$12,Info_Roster_Values_Labels,0),FALSE)","v":""}]
[null,"Gear",{"$f":"HLOOKUP($A54,Info_Roster_Values,MATCH(B$13,Info_Roster_Values_Labels,0),FALSE)","v":""}]
[11,{"$f":"HLOOKUP($A59,Info_Roster_Values,MATCH(B$8,Info_Roster_Values_Labels,0),FALSE)","v":""},"","",0,0,0,0,"Uninjured","",{"$f":"HLOOKUP($A59,Info_Roster_Values,MATCH(K$8,Info_Roster_Values_Labels,0),FALSE)","v":""}]
[null,"Attributes",{"$f":"HLOOKUP($A59,Info_Roster_Values,MATCH(B$10,Info_Roster_Values_Labels,0),FALSE)","v":""}]
[null,"Skills",{"$f":"HLOOKUP($A59,Info_Roster_Values,MATCH(B$11,Info_Roster_Values_Labels,0),FALSE)","v":""}]
[null,"Edges",{"$f":"HLOOKUP($A59,Info_Roster_Values,MATCH(B$12,Info_Roster_Values_Labels,0),FALSE)","v":""}]
[null,"Gear",{"$f":"HLOOKUP($A59,Info_Roster_Values,MATCH(B$13,Info_Roster_Values_Labels,0),FALSE)","v":""}]
[12,{"$f":"HLOOKUP($A64,Info_Roster_Values,MATCH(B$8,Info_Roster_Values_Labels,0),FALSE)","v":""},"","",0,0,0,0,"Uninjured","",{"$f":"HLOOKUP($A64,Info_Roster_Values,MATCH(K$8,Info_Roster_Values_Labels,0),FALSE)","v":""}]
[null,"Attributes",{"$f":"HLOOKUP($A64,Info_Roster_Values,MATCH(B$10,Info_Roster_Values_Labels,0),FALSE)","v":""}]
[null,"Skills",{"$f":"HLOOKUP($A64,Info_Roster_Values,MATCH(B$11,Info_Roster_Values_Labels,0),FALSE)","v":""}]
[null,"Edges",{"$f":"HLOOKUP($A64,Info_Roster_Values,MATCH(B$12,Info_Roster_Values_Labels,0),FALSE)","v":""}]
[null,"Gear",{"$f":"HLOOKUP($A64,Info_Roster_Values,MATCH(B$13,Info_Roster_Values_Labels,0),FALSE)","v":""}]

{"sheet":"Roster Selection","index":2,"n_rows":60,"n_cols":25,"rows_kept":60,"merged":[[0,1,0,9],[1,1,1,9],[2,1,2,3],[2,4,2,6],[2,7,2,9],[3,1,3,2],[3,4,3,5],[3,7,3,8],[4,1,4,2],[4,4,4,5],[4,7,4,8],[4,10,4,11],[4,13,4,14],[6,1,6,2],[6,3,6,4],[6,5,6,6],[6,7,6,8],[6,9,6,10],[6,11,6,12],[6,13,6,14],[6,15,6,16],[6,17,6,18],[6,19,6,20],[6,21,6,22],[6,23,6,24],[8,1,8,2],[8,3,8,4],[8,5,8,6],[8,7,8,8],[8,9,8,10],[8,11,8,12],[8,13,8,14],[8,15,8,16],[8,17,8,18],[8,19,8,20],[8,21,8,22],[8,23,8,24],[9,1,9,2],[9,3,9,4],[9,5,9,6],[9,7,9,8],[9,9,9,10],[9,11,9,12],[9,13,9,14],[9,15,9,16],[9,17,9,18],[9,19,9,20],[9,21,9,22],[9,23,9,24],[10,1,10,2],[10,3,10,4],[10,5,10,6],[10,7,10,8],[10,9,10,10],[10,11,10,12],[10,13,10,14],[10,15,10,16],[10,17,10,18],[10,19,10,20],[10,21,10,22],[10,23,10,24],[11,1,11,2],[11,3,11,4],[11,5,11,6],[11,7,11,8],[11,9,11,10],[11,11,11,12],[11,13,11,14],[11,15,11,16],[11,17,11,18],[11,19,11,20],[11,21,11,22],[11,23,11,24],[12,1,12,2],[12,3,12,4],[12,5,12,6],[12,7,12,8],[12,9,12,10],[12,11,12,12],[12,13,12,14],[12,15,12,16],[12,17,12,18],[12,19,12,20],[12,21,12,22],[12,23,12,24],[13,1,13,2],[13,3,13,4],[13,5,13,6],[13,7,13,8],[13,9,13,10],[13,11,13,12],[13,13,13,14],[13,15,13,16],[13,17,13,18],[13,19,13,20],[13,21,13,22],[13,23,13,24],[14,1,14,2],[14,3,14,4],[14,5,14,6],[14,7,14,8],[14,9,14,10],[14,11,14,12],[14,13,14,14],[14,15,14,16],[14,17,14,18],[14,19,14,20],[14,21,14,22],[14,23,14,24],[17,1,17,2],[17,3,17,4],[17,5,17,6],[17,7,17,8],[17,9,17,10],[17,11,17,12],[17,13,17,14],[17,15,17,16],[17,17,17,18],[17,19,17,20],[17,21,17,22],[17,23,17,24],[49,1,49,2],[49,3,49,4],[49,5,49,6],[49,7,49,8],[49,9,49,10],[49,11,49,12],[49,13,49,14],[49,15,49,16],[49,17,49,18],[49,19,49,20],[49,21,49,22],[49,23,49,24],[50,1,50,2],[50,3,50,4],[50,5,50,6],[50,7,50,8],[50,9,50,10],[50,11,50,12],[50,13,50,14],[50,15,50,16],[50,17,50,18],[50,19,50,20],[50,21,50,22],[50,23,50,24],[51,1,51,2],[51,3,51,4],[51,5,51,6],[51,7,51,8],[51,9,51,10],[51,11,51,12],[51,13,51,14],[51,15,51,16],[51,17,51,18],[51,19,51,20],[51,21,51,22],[51,23,51,24],[52,1,52,2],[52,3,52,4],[52,5,52,6],[52,7,52,8],[52,9,52,10],[52,11,52,12],[52,13,52,14],[52,15,52,16],[52,17,52,18],[52,19,52,20],[52,21,52,22],[52,23,52,24],[53,1,53,2],[53,3,53,4],[53,5,53,6],[53,7,53,8],[53,9,53,10],[53,11,53,12],[53,13,53,14],[53,15,53,16],[53,17,53,18],[53,19,53,20],[53,21,53,22],[53,23,53,24],[54,1,54,2],[54,3,54,4],[54,5,54,6],[54,7,54,8],[54,9,54,10],[54,11,54,12],[54,13,54,14],[54,15,54,16],[54,17,54,18],[54,19,54,20],[54,21,54,22],[54,23,54,24],[55,1,55,2],[55,3,55,4],[55,5,55,6],[55,7,55,8],[55,9,55,10],[55,11,55,12],[55,13,55,14],[55,15,55,16],[55,17,55,18],[55,19,55,20],[55,21,55,22],[55,23,55,24],[56,1,56,2],[56,3,56,4],[56,5,56,6],[56,7,56,8],[56,9,56,10],[56,11,56,12],[56,13,56,14],[56,15,56,16],[56,17,56,18],[56,19,56,20],[56,21,56,22],[56,23,56,24],[57,1,57,2],[57,3,57,4],[57,5,57,6],[57,7,57,8],[57,9,57,10],[57,11,57,12],[57,13,57,14],[57,15,57,16],[57,17,57,18],[57,19,57,20],[57,21,57,22],[57,23,57,24],[58,1,58,2],[58,3,58,4],[58,5,58,6],[58,7,58,8],[58,9,58,10],[58,11,58,12],[58,13,58,14],[58,15,58,16],[58,17,58,18],[58,19,58,20],[58,21,58,22],[58,23,58,24],[59,1,59,2],[59,3,59,4],[59,5,59,6],[59,7,59,8],[59,9,59,10],[59,11,59,12],[59,13,59,14],[59,15,59,16],[59,17,59,18],[59,19,59,20],[59,21,59,22],[59,23,59,24]]}
["Team Name:"]
["Player:"]
["Team Type","Regular",null,null,"League Type",null,null,"Quick Match"]
["Team Celebrity:","Start",null,"d4-2","MidSeason",null,null,"Cost",null,{"$f":"IF(RS_BaseCelebrity=\"\",0,IF(RS_League=\"Quick Match\",0,VLOOKUP(D4,Info_Die_Types_Data,2,FALSE)*VLOOKUP(RS_League,Info_League_Data,7,FALSE)+(G4*2*VLOOKUP(RS_League,Info_League_Data,7,FALSE))))","v":0}]
["Arena Points","Allowed",null,{"$f":"VLOOKUP(RS_League,Info_League_Data,2,FALSE)","v":50},"Spent",null,{"$f":"SUM(RS_Value,RS_CelebrityCost)-SUMIF(B12:Y12,\"Y\",RS_Value)","v":0},"Assets Spend",null,{"$f":"SUM(Assets_Arena_Points_Spent)","v":0},"Remaining",null,{"$f":"D5-G5-J5+P5","v":50},"Earnt"]
[]
["Position",1,null,2,null,3,null,4,null,5,null,6,null,7,null,8,null,9,null,10,null,11,null,12]
["Gladiators","Base","Mod","Base","Mod","Base","Mod","Base","Mod","Base","Mod","Base","Mod","Base","Mod","Base","Mod","Base","Mod","Base","Mod","Base","Mod","Base","Mod"]
["Name"]
["Gladiator Role"]
["Type"]
["Mercenary","N",null,"N",null,"N",null,"N",null,"N",null,"N",null,"N",null,"N",null,"N",null,"N",null,"N",null,"N"]
["Tricarnian",{"$f":"IF(B10=\"\",\"\",VLOOKUP(B10,Info_Gladiator_Data,2,FALSE))","v":""},null,{"$f":"IF(D10=\"\",\"\",VLOOKUP(D10,Info_Gladiator_Data,2,FALSE))","v":""},null,{"$f":"IF(F10=\"\",\"\",VLOOKUP(F10,Info_Gladiator_Data,2,FALSE))","v":""},null,{"$f":"IF(H10=\"\",\"\",VLOOKUP(H10,Info_Gladiator_Data,2,FALSE))","v":""},null,{"$f":"IF(J10=\"\",\"\",VLOOKUP(J10,Info_Gladiator_Data,2,FALSE))","v":""},null,{"$f":"IF(L10=\"\",\"\",VLOOKUP(L10,Info_Gladiator_Data,2,FALSE))","v":""},null,{"$f":"IF(N10=\"\",\"\",VLOOKUP(N10,Info_Gladiator_Data,2,FALSE))","v":""},null,{"$f":"IF(P10=\"\",\"\",VLOOKUP(P10,Info_Gladiator_Data,2,FALSE))","v":""},null,{"$f":"IF(R10=\"\",\"\",VLOOKUP(R10,Info_Gladiator_Data,2,FALSE))","v":""},null,{"$f":"IF(T10=\"\",\"\",VLOOKUP(T10,Info_Gladiator_Data,2,FALSE))","v":""},null,{"$f":"IF(V10=\"\",\"\",VLOOKUP(V10,Info_Gladiator_Data,2,FALSE))","v":""},null,{"$f":"IF(X10=\"\",\"\",VLOOKUP(X10,Info_Gladiator_Data,2,FALSE))","v":""}]
["Value",{"$f":"IF(AND(B10<>\"\",B11<>\"\"),IF(B12=\"Y\",ROUNDUP(VLOOKUP(B10,Info_Gladiator_Data,VLOOKUP(B11,Info_Type_Data,2,FALSE),FALSE)*0.5,0),VLOOKUP(B10,Info_Gladiator_Data,VLOOKUP(B11,Info_Type_Data,2,FALSE),FALSE)),\"\")","v":""},null,{"$f":"IF(AND(D10<>\"\",D11<>\"\"),IF(D12=\"Y\",ROUNDUP(VLOOKUP(D10,Info_Gladiator_Data,VLOOKUP(D11,Info_Type_Data,2,FALSE),FALSE)*0.5,0),VLOOKUP(D10,Info_Gladiator_Data,VLOOKUP(D11,Info_Type_Data,2,FALSE),FALSE)),\"\")","v":""},null,{"$f":"IF(AND(F10<>\"\",F11<>\"\"),IF(F12=\"Y\",ROUNDUP(VLOOKUP(F10,Info_Gladiator_Data,VLOOKUP(F11,Info_Type_Data,2,FALSE),FALSE)*0.5,0),VLOOKUP(F10,Info_Gladiator_Data,VLOOKUP(F11,Info_Type_Data,2,FALSE),FALSE)),\"\")","v":""},null,{"$f":"IF(AND(H10<>\"\",H11<>\"\"),IF(H12=\"Y\",ROUNDUP(VLOOKUP(H10,Info_Gladiator_Data,VLOOKUP(H11,Info_Type_Data,2,FALSE),FALSE)*0.5,0),VLOOKUP(H10,Info_Gladiator_Data,VLOOKUP(H11,Info_Type_Data,2,FALSE),FALSE)),\"\")","v":""},null,{"$f":"IF(AND(J10<>\"\",J11<>\"\"),IF(J12=\"Y\",ROUNDUP(VLOOKUP(J10,Info_Gladiator_Data,VLOOKUP(J11,Info_Type_Data,2,FALSE),FALSE)*0.5,0),VLOOKUP(J10,Info_Gladiator_Data,VLOOKUP(J11,Info_Type_Data,2,FALSE),FALSE)),\"\")","v":""},null,{"$f":"IF(AND(L10<>\"\",L11<>\"\"),IF(L12=\"Y\",ROUNDUP(VLOOKUP(L10,Info_Gladiator_Data,VLOOKUP(L11,Info_Type_Data,2,FALSE),FALSE)*0.5,0),VLOOKUP(L10,Info_Gladiator_Data,VLOOKUP(L11,Info_Type_Data,2,FALSE),FALSE)),\"\")","v":""},null,{"$f":"IF(AND(N10<>\"\",N11<>\"\"),IF(N12=\"Y\",ROUNDUP(VLOOKUP(N10,Info_Gladiator_Data,VLOOKUP(N11,Info_Type_Data,2,FALSE),FALSE)*0.5,0),VLOOKUP(N10,Info_Gladiator_Data,VLOOKUP(N11,Info_Type_Data,2,FALSE),FALSE)),\"\")","v":""},null,{"$f":"IF(AND(P10<>\"\",P11<>\"\"),IF(P12=\"Y\",ROUNDUP(VLOOKUP(P10,Info_Gladiator_Data,VLOOKUP(P11,Info_Type_Data,2,FALSE),FALSE)*0.5,0),VLOOKUP(P10,Info_Gladiator_Data,VLOOKUP(P11,Info_Type_Data,2,FALSE),FALSE)),\"\")","v":""},null,{"$f":"IF(AND(R10<>\"\",R11<>\"\"),IF(R12=\"Y\",ROUNDUP(VLOOKUP(R10,Info_Gladiator_Data,VLOOKUP(R11,Info_Type_Data,2,FALSE),FALSE)*0.5,0),VLOOKUP(R10,Info_Gladiator_Data,VLOOKUP(R11,Info_Type_Data,2,FALSE),FALSE)),\"\")","v":""},null,{"$f":"IF(AND(T10<>\"\",T11<>\"\"),IF(T12=\"Y\",ROUNDUP(VLOOKUP(T10,Info_Gladiator_Data,VLOOKUP(T11,Info_Type_Data,2,FALSE),FALSE)*0.5,0),VLOOKUP(T10,Info_Gladiator_Data,VLOOKUP(T11,Info_Type_Data,2,FALSE),FALSE)),\"\")","v":""},null,{"$f":"IF(AND(V10<>\"\",V11<>\"\"),IF(V12=\"Y\",ROUNDUP(VLOOKUP(V10,Info_Gladiator_Data,VLOOKUP(V11,Info_Type_Data,2,FALSE),FALSE)*0.5,0),VLOOKUP(V10,Info_Gladiator_Data,VLOOKUP(V11,Info_Type_Data,2,FALSE),FALSE)),\"\")","v":""},null,{"$f":"IF(AND(X10<>\"\",X11<>\"\"),IF(X12=\"Y\",ROUNDUP(VLOOKUP(X10,Info_Gladiator_Data,VLOOKUP(X11,Info_Type_Data,2,FALSE),FALSE)*0.5,0),VLOOKUP(X10,Info_Gladiator_Data,VLOOKUP(X11,Info_Type_Data,2,FALSE),FALSE)),\"\")","v":""}]
["Wounds",{"$f":"IF(B11=\"\",\"\",VLOOKUP(B11,Info_Type_Data,3,FALSE))","v":""},null,{"$f":"IF(D11=\"\",\"\",VLOOKUP(D11,Info_Type_Data,3,FALSE))","v":""},null,{"$f":"IF(F11=\"\",\"\",VLOOKUP(F11,Info_Type_Data,3,FALSE))","v":""},null,{"$f":"IF(H11=\"\",\"\",VLOOKUP(H11,Info_Type_Data,3,FALSE))","v":""},null,{"$f":"IF(J11=\"\",\"\",VLOOKUP(J11,Info_Type_Data,3,FALSE))","v":""},null,{"$f":"IF(L11=\"\",\"\",VLOOKUP(L11,Info_Type_Data,3,FALSE))","v":""},null,{"$f":"IF(N11=\"\",\"\",VLOOKUP(N11,Info_Type_Data,3,FALSE))","v":""},null,{"$f":"IF(P11=\"\",\"\",VLOOKUP(P11,Info_Type_Data,3,FALSE))","v":""},null,{"$f":"IF(R11=\"\",\"\",VLOOKUP(R11,Info_Type_Data,3,FALSE))","v":""},null,{"$f":"IF(T11=\"\",\"\",VLOOKUP(T11,Info_Type_Data,3,FALSE))","v":""},null,{"$f":"IF(V11=\"\",\"\",VLOOKUP(V11,Info_Type_Data,3,FALSE))","v":""},null,{"$f":"IF(X11=\"\",\"\",VLOOKUP(X11,Info_Type_Data,3,FALSE))","v":""}]
["Bennies",{"$f":"IF(B11=\"\",0,VLOOKUP(B11,Info_Type_Data,4,FALSE))+IF(B50<>\"\",IF(ISERROR(SEARCH(\"Luck\",B50,1)),0,1)+IF(ISERROR(SEARCH(\"Great Luck\",B50,1)),0,1),0)+COUNTIF(B51:C58,\"Luck\")+COUNTIF(B51:C58,\"Great Luck\")","v":0},null,{"$f":"IF(D11=\"\",0,VLOOKUP(D11,Info_Type_Data,4,FALSE))+IF(D50<>\"\",IF(ISERROR(SEARCH(\"Luck\",D50,1)),0,1)+IF(ISERROR(SEARCH(\"Great Luck\",D50,1)),0,1),0)+COUNTIF(D51:E58,\"Luck\")+COUNTIF(D51:E58,\"Great Luck\")","v":0},null,{"$f":"IF(F11=\"\",0,VLOOKUP(F11,Info_Type_Data,4,FALSE))+IF(F50<>\"\",IF(ISERROR(SEARCH(\"Luck\",F50,1)),0,1)+IF(ISERROR(SEARCH(\"Great Luck\",F50,1)),0,1),0)+COUNTIF(F51:G58,\"Luck\")+COUNTIF(F51:G58,\"Great Luck\")","v":0},null,{"$f":"IF(H11=\"\",0,VLOOKUP(H11,Info_Type_Data,4,FALSE))+IF(H50<>\"\",IF(ISERROR(SEARCH(\"Luck\",H50,1)),0,1)+IF(ISERROR(SEARCH(\"Great Luck\",H50,1)),0,1),0)+COUNTIF(H51:I58,\"Luck\")+COUNTIF(H51:I58,\"Great Luck\")","v":0},null,{"$f":"IF(J11=\"\",0,VLOOKUP(J11,Info_Type_Data,4,FALSE))+IF(J50<>\"\",IF(ISERROR(SEARCH(\"Luck\",J50,1)),0,1)+IF(ISERROR(SEARCH(\"Great Luck\",J50,1)),0,1),0)+COUNTIF(J51:K58,\"Luck\")+COUNTIF(J51:K58,\"Great Luck\")","v":0},null,{"$f":"IF(L11=\"\",0,VLOOKUP(L11,Info_Type_Data,4,FALSE))+IF(L50<>\"\",IF(ISERROR(SEARCH(\"Luck\",L50,1)),0,1)+IF(ISERROR(SEARCH(\"Great Luck\",L50,1)),0,1),0)+COUNTIF(L51:M58,\"Luck\")+COUNTIF(L51:M58,\"Great Luck\")","v":0},null,{"$f":"IF(N11=\"\",0,VLOOKUP(N11,Info_Type_Data,4,FALSE))+IF(N50<>\"\",IF(ISERROR(SEARCH(\"Luck\",N50,1)),0,1)+IF(ISERROR(SEARCH(\"Great Luck\",N50,1)),0,1),0)+COUNTIF(N51:O58,\"Luck\")+COUNTIF(N51:O58,\"Great Luck\")","v":0},null,{"$f":"IF(P11=\"\",0,VLOOKUP(P11,Info_Type_Data,4,FALSE))+IF(P50<>\"\",IF(ISERROR(SEARCH(\"Luck\",P50,1)),0,1)+IF(ISERROR(SEARCH(\"Great Luck\",P50,1)),0,1),0)+COUNTIF(P51:Q58,\"Luck\")+COUNTIF(P51:Q58,\"Great Luck\")","v":0},null,{"$f":"IF(R11=\"\",0,VLOOKUP(R11,Info_Type_Data,4,FALSE))+IF(R50<>\"\",IF(ISERROR(SEARCH(\"Luck\",R50,1)),0,1)+IF(ISERROR(SEARCH(\"Great Luck\",R50,1)),0,1),0)+COUNTIF(R51:S58,\"Luck\")+COUNTIF(R51:S58,\"Great Luck\")","v":0},null,{"$f":"IF(T11=\"\",0,VLOOKUP(T11,Info_Type_Data,4,FALSE))+IF(T50<>\"\",IF(ISERROR(SEARCH(\"Luck\",T50,1)),0,1)+IF(ISERROR(SEARCH(\"Great Luck\",T50,1)),0,1),0)+COUNTIF(T51:U58,\"Luck\")+COUNTIF(T51:U58,\"Great Luck\")","v":0},null,{"$f":"IF(V11=\"\",0,VLOOKUP(V11,Info_Type_Data,4,FALSE))+IF(V50<>\"\",IF(ISERROR(SEARCH(\"Luck\",V50,1)),0,1)+IF(ISERROR(SEARCH(\"Great Luck\",V50,1)),0,1),0)+COUNTIF(V51:W58,\"Luck\")+COUNTIF(V51:W58,\"Great Luck\")","v":0},null,{"$f":"IF(X11=\"\",0,VLOOKUP(X11,Info_Type_Data,4,FALSE))+IF(X50<>\"\",IF(ISERROR(SEARCH(\"Luck\",X50,1)),0,1)+IF(ISERROR(SEARCH(\"Great Luck\",X50,1)),0,1),0)+COUNTIF(X51:Y58,\"Luck\")+COUNTIF(X51:Y58,\"Great Luck\")","v":0}]
["Kill Points",{"$f":"SUM(C$19:C$27)+SUM(C$28:C$49)+(14-COUNTBLANK(B$51:C$57))&\" / \"&ROUNDDOWN(C17/5,0)","v":"0 / 0"},null,{"$f":"ROUNDDOWN(E17/5,0)","v":0},null,{"$f":"ROUNDDOWN(G17/5,0)","v":0},null,{"$f":"ROUNDDOWN(I17/5,0)","v":0},null,{"$f":"ROUNDDOWN(K17/5,0)","v":0},null,{"$f":"ROUNDDOWN(M17/5,0)","v":0},null,{"$f":"ROUNDDOWN(O17/5,0)","v":0},null,{"$f":"ROUNDDOWN(Q17/5,0)","v":0},null,{"$f":"ROUNDDOWN(S17/5,0)","v":0},null,{"$f":"ROUNDDOWN(U17/5,0)","v":0},null,{"$f":"ROUNDDOWN(W17/5,0)","v":0},null,{"$f":"ROUNDDOWN(Y17/5,0)","v":0}]
["Injury Status","Uninjured",null,"Uninjured",null,"Uninjured",null,"Uninjured",null,"Uninjured",null,"Uninjured",null,"Uninjured",null,"Uninjured",null,"Uninjured",null,"Uninjured",null,"Uninjured",null,"Uninjured"]
["Agility",{"$f":"IF(B$10=\"\",\"\",IF(VLOOKUP(B$10,Info_Gladiator_Data,MATCH($A19,Info_Gladiator_Headers,0),FALSE)=0,\"\",VLOOKUP(B$10,Info_Gladiator_Data,MATCH($A19,Info_Gladiator_Headers,0),FALSE)))","v":""},null,{"$f":"IF(D$10=\"\",\"\",IF(VLOOKUP(D$10,Info_Gladiator_Data,MATCH($A19,Info_Gladiator_Headers,0),FALSE)=0,\"\",VLOOKUP(D$10,Info_Gladiator_Data,MATCH($A19,Info_Gladiator_Headers,0),FALSE)))","v":""},null,{"$f":"IF(F$10=\"\",\"\",IF(VLOOKUP(F$10,Info_Gladiator_Data,MATCH($A19,Info_Gladiator_Headers,0),FALSE)=0,\"\",VLOOKUP(F$10,Info_Gladiator_Data,MATCH($A19,Info_Gladiator_Headers,0),FALSE)))","v":""},null,{"$f":"IF(H$10=\"\",\"\",IF(VLOOKUP(H$10,Info_Gladiator_Data,MATCH($A19,Info_Gladiator_Headers,0),FALSE)=0,\"\",VLOOKUP(H$10,Info_Gladiator_Data,MATCH($A19,Info_Gladiator_Headers,0),FALSE)))","v":""},null,{"$f":"IF(J$10=\"\",\"\",IF(VLOOKUP(J$10,Info_Gladiator_Data,MATCH($A19,Info_Gladiator_Headers,0),FALSE)=0,\"\",VLOOKUP(J$10,Info_Gladiator_Data,MATCH($A19,Info_Gladiator_Headers,0),FALSE)))","v":""},null,{"$f":"IF(L$10=\"\",\"\",IF(VLOOKUP(L$10,Info_Gladiator_Data,MATCH($A19,Info_Gladiator_Headers,0),FALSE)=0,\"\",VLOOKUP(L$10,Info_Gladiator_Data,MATCH($A19,Info_Gladiator_Headers,0),FALSE)))","v":""},null,{"$f":"IF(N$10=\"\",\"\",IF(VLOOKUP(N$10,Info_Gladiator_Data,MATCH($A19,Info_Gladiator_Headers,0),FALSE)=0,\"\",VLOOKUP(N$10,Info_Gladiator_Data,MATCH($A19,Info_Gladiator_Headers,0),FALSE)))","v":""},null,{"$f":"IF(P$10=\"\",\"\",IF(VLOOKUP(P$10,Info_Gladiator_Data,MATCH($A19,Info_Gladiator_Headers,0),FALSE)=0,\"\",VLOOKUP(P$10,Info_Gladiator_Data,MATCH($A19,Info_Gladiator_Headers,0),FALSE)))","v":""},null,{"$f":"IF(R$10=\"\",\"\",IF(VLOOKUP(R$10,Info_Gladiator_Data,MATCH($A19,Info_Gladiator_Headers,0),FALSE)=0,\"\",VLOOKUP(R$10,Info_Gladiator_Data,MATCH($A19,Info_Gladiator_Headers,0),FALSE)))","v":""},null,{"$f":"IF(T$10=\"\",\"\",IF(VLOOKUP(T$10,Info_Gladiator_Data,MATCH($A19,Info_Gladiator_Headers,0),FALSE)=0,\"\",VLOOKUP(T$10,Info_Gladiator_Data,MATCH($A19,Info_Gladiator_Headers,0),FALSE)))","v":""},null,{"$f":"IF(V$10=\"\",\"\",IF(VLOOKUP(V$10,Info_Gladiator_Data,MATCH($A19,Info_Gladiator_Headers,0),FALSE)=0,\"\",VLOOKUP(V$10,Info_Gladiator_Data,MATCH($A19,Info_Gladiator_Headers,0),FALSE)))","v":""},null,{"$f":"IF(X$10=\"\",\"\",IF(VLOOKUP(X$10,Info_Gladiator_Data,MATCH($A19,Info_Gladiator_Headers,0),FALSE)=0,\"\",VLOOKUP(X$10,Info_Gladiator_Data,MATCH($A19,Info_Gladiator_Headers,0),FALSE)))","v":""}]
["Smarts","",null,"",null,"",null,"",null,"",null,"",null,"",null,"",null,"",null,"",null,"",null,""]
["Spirit","",null,"",null,"",null,"",null,"",null,"",null,"",null,"",null,"",null,"",null,"",null,""]
["Strength","",null,"",null,"",null,"",null,"",null,"",null,"",null,"",null,"",null,"",null,"",null,""]
["Vigor","",null,"",null,"",null,"",null,"",null,"",null,"",null,"",null,"",null,"",null,"",null,""]
["Charisma","",null,"",null,"",null,"",null,"",null,"",null,"",null,"",null,"",null,"",null,"",null,""]
["Pace","",null,"",null,"",null,"",null,"",null,"",null,"",null,"",null,"",null,"",null,"",null,""]
["Parry","",null,"",null,"",null,"",null,"",null,"",null,"",null,"",null,"",null,"",null,"",null,""]
["Toughness","",null,"",null,"",null,"",null,"",null,"",null,"",null,"",null,"",null,"",null,"",null,""]
["Driving","",null,"",null,"",null,"",null,"",null,"",null,"",null,"",null,"",null,"",null,"",null,""]
["Fighting","",null,"",null,"",null,"",null,"",null,"",null,"",null,"",null,"",null,"",null,"",null,""]
["Healing","",null,"",null,"",null,"",null,"",null,"",null,"",null,"",null,"",null,"",null,"",null,""]
["Intimdation","",null,"",null,"",null,"",null,"",null,"",null,"",null,"",null,"",null,"",null,"",null,""]
["Notice","",null,"",null,"",null,"",null,"",null,"",null,"",null,"",null,"",null,"",null,"",null,""]
["Riding","",null,"",null,"",null,"",null,"",null,"",null,"",null,"",null,"",null,"",null,"",null,""]
["Shooting","",null,"",null,"",null,"",null,"",null,"",null,"",null,"",null,"",null,"",null,"",null,""]
["Stealth","",null,"",null,"",null,"",null,"",null,"",null,"",null,"",null,"",null,"",null,"",null,""]
["Taunt","",null,"",null,"",null,"",null,"",null,"",null,"",null,"",null,"",null,"",null,"",null,""]
["Throwing","",null,"",null,"",null,"",null,"",null,"",null,"",null,"",null,"",null,"",null,"",null,""]
["Boating","",null,"",null,"",null,"",null,"",null,"",null,"",null,"",null,"",null,"",null,"",null,""]
["Climbing","",null,"",null,"",null,"",null,"",null,"",null,"",null,"",null,"",null,"",null,"",null,""]
["Gambling","",null,"",null,"",null,"",null,"",null,"",null,"",null,"",null,"",null,"",null,"",null,""]
["Investigation","",null,"",null,"",null,"",null,"",null,"",null,"",null,"",null,"",null,"",null,"",null,""]
["Lockpicking","",null,"",null,"",null,"",null,"",null,"",null,"",null,"",null,"",null,"",null,"",null,""]
["Persuasion","",null,"",null,"",null,"",null,"",null,"",null,"",null,"",null,"",null,"",null,"",null,""]
["Piloting","",null,"",null,"",null,"",null,"",null,"",null,"",null,"",null,"",null,"",null,"",null,""]
["Repair","",null,"",null,"",null,"",null,"",null,"",null,"",null,"",null,"",null,"",null,"",null,""]
["Streetwise","",null,"",null,"",null,"",null,"",null,"",null,"",null,"",null,"",null,"",null,"",null,""]
["Survival","",null,"",null,"",null,"",null,"",null,"",null,"",null,"",null,"",null,"",null,"",null,""]
["Swimming","",null,"",null,"",null,"",null,"",null,"",null,"",null,"",null,"",null,"",null,"",null,""]
["Tracking",{"$f":"IF(B$10=\"\",\"\",IF(VLOOKUP(B$10,Info_Gladiator_Data,MATCH($A49,Info_Gladiator_Headers,0),FALSE)=0,\"\",VLOOKUP(B$10,Info_Gladiator_Data,MATCH($A49,Info_Gladiator_Headers,0),FALSE)))","v":""},null,"",null,"",null,"",null,"",null,"",null,"",null,"",null,"",null,"",null,"",null,""]
["Base Edges",{"$f":"IF(B$10=\"\",\"\",IF(VLOOKUP(B$10,Info_Gladiator_Data,MATCH($A50,Info_Gladiator_Headers,0),FALSE)=0,\"\",VLOOKUP(B$10,Info_Gladiator_Data,MATCH($A50,Info_Gladiator_Headers,0),FALSE)))","v":""},null,"",null,"",null,"",null,"",null,"",null,"",null,"",null,"",null,"",null,"",null,""]
["Additional Edge 1"]
["Additional Edge 2"]
["Additional Edge 3"]
["Additional Edge 4"]
["Additional Edge 5"]
["Additional Edge 6"]
["Additional Edge 7"]
["Notes"]
["Base Gear",{"$f":"IF(B$10=\"\",\"\",IF(VLOOKUP(B$10,Info_Gladiator_Data,MATCH($A59,Info_Gladiator_Headers,0),FALSE)=0,\"\",VLOOKUP(B$10,Info_Gladiator_Data,MATCH($A59,Info_Gladiator_Headers,0),FALSE)))","v":""},null,{"$f":"IF(D$10=\"\",\"\",IF(VLOOKUP(D$10,Info_Gladiator_Data,MATCH($A59,Info_Gladiator_Headers,0),FALSE)=0,\"\",VLOOKUP(D$10,Info_Gladiator_Data,MATCH($A59,Info_Gladiator_Headers,0),FALSE)))","v":""},null,{"$f":"IF(F$10=\"\",\"\",IF(VLOOKUP(F$10,Info_Gladiator_Data,MATCH($A59,Info_Gladiator_Headers,0),FALSE)=0,\"\",VLOOKUP(F$10,Info_Gladiator_Data,MATCH($A59,Info_Gladiator_Headers,0),FALSE)))","v":""},null,{"$f":"IF(H$10=\"\",\"\",IF(VLOOKUP(H$10,Info_Gladiator_Data,MATCH($A59,Info_Gladiator_Headers,0),FALSE)=0,\"\",VLOOKUP(H$10,Info_Gladiator_Data,MATCH($A59,Info_Gladiator_Headers,0),FALSE)))","v":""},null,{"$f":"IF(J$10=\"\",\"\",IF(VLOOKUP(J$10,Info_Gladiator_Data,MATCH($A59,Info_Gladiator_Headers,0),FALSE)=0,\"\",VLOOKUP(J$10,Info_Gladiator_Data,MATCH($A59,Info_Gladiator_Headers,0),FALSE)))","v":""},null,{"$f":"IF(L$10=\"\",\"\",IF(VLOOKUP(L$10,Info_Gladiator_Data,MATCH($A59,Info_Gladiator_Headers,0),FALSE)=0,\"\",VLOOKUP(L$10,Info_Gladiator_Data,MATCH($A59,Info_Gladiator_Headers,0),FALSE)))","v":""},null,{"$f":"IF(N$10=\"\",\"\",IF(VLOOKUP(N$10,Info_Gladiator_Data,MATCH($A59,Info_Gladiator_Headers,0),FALSE)=0,\"\",VLOOKUP(N$10,Info_Gladiator_Data,MATCH($A59,Info_Gladiator_Headers,0),FALSE)))","v":""},null,{"$f":"IF(P$10=\"\",\"\",IF(VLOOKUP(P$10,Info_Gladiator_Data,MATCH($A59,Info_Gladiator_Headers,0),FALSE)=0,\"\",VLOOKUP(P$10,Info_Gladiator_Data,MATCH($A59,Info_Gladiator_Headers,0),FALSE)))","v":""},null,{"$f":"IF(R$10=\"\",\"\",IF(VLOOKUP(R$10,Info_Gladiator_Data,MATCH($A59,Info_Gladiator_Headers,0),FALSE)=0,\"\",VLOOKUP(R$10,Info_Gladiator_Data,MATCH($A59,Info_Gladiator_Headers,0),FALSE)))","v":""},null,{"$f":"IF(T$10=\"\",\"\",IF(VLOOKUP(T$10,Info_Gladiator_Data,MATCH($A59,Info_Gladiator_Headers,0),FALSE)=0,\"\",VLOOKUP(T$10,Info_Gladiator_Data,MATCH($A59,Info_Gladiator_Headers,0),FALSE)))","v":""},null,{"$f":"IF(V$10=\"\",\"\",IF(VLOOKUP(V$10,Info_Gladiator_Data,MATCH($A59,Info_Gladiator_Headers,0),FALSE)=0,\"\",VLOOKUP(V$10,Info_Gladiator_Data,MATCH($A59,Info_Gladiator_Headers,0),FALSE)))","v":""},null,{"$f":"IF(X$10=\"\",\"\",IF(VLOOKUP(X$10,Info_Gladiator_Data,MATCH($A59,Info_Gladiator_Headers,0),FALSE)=0,\"\",VLOOKUP(X$10,Info_Gladiator_Data,MATCH($A59,Info_Gladiator_Headers,0),FALSE)))","v":""}]
["Additional Gear"]

{"sheet":"Assets","index":3,"n_rows":16,"n_cols":6,"rows_kept":16}
["Assets","Max","Cost Per Unit","Purchased","Arena Points Spent","Notes"]
["Agitator",{"$f":"VLOOKUP(A2,Info_Asset_Data,2,FALSE)","v":5},{"$f":"VLOOKUP(A2,Info_Asset_Data,6,FALSE)","v":1},null,{"$f":"IF(OR(D2=\"\",D2=0),\"\",D2*(D2+1)/2)","v":""},{"$f":"IF(VLOOKUP(A2,Info_Asset_Data,4,FALSE)=\"\",\"\",VLOOKUP(A2,Info_Asset_Data,4,FALSE))","v":"Hostile Asset"}]
["Augur",1,1,null,{"$f":"IF(OR(D3=0,D3=\"\"),\"\",VLOOKUP(A3,Info_Asset_Data,3,FALSE)*Assets!D3)","v":""},"Single use"]
["Assassin",1,1,null,{"$f":"IF(OR(D4=0,D4=\"\"),\"\",VLOOKUP(A4,Info_Asset_Data,3,FALSE)*Assets!D4)","v":""},"Hostile Asset"]
["Courtesan",2,2,null,{"$f":"IF(OR(D5=0,D5=\"\"),\"\",VLOOKUP(A5,Info_Asset_Data,3,FALSE)*Assets!D5)","v":""},"Hostile Asset"]
["Excellent Weapon/Armor",2,2,null,{"$f":"IF(OR(D6=0,D6=\"\"),\"\",VLOOKUP(A6,Info_Asset_Data,3,FALSE)*Assets!D6)","v":""},"Item"]
["Guard",5,5,null,{"$f":"IF(OR(D7=0,D7=\"\"),\"\",VLOOKUP(A7,Info_Asset_Data,3,FALSE)*Assets!D7)","v":""},""]
["Guard Captain",1,1,null,{"$f":"IF(OR(D8=0,D8=\"\"),\"\",VLOOKUP(A8,Info_Asset_Data,3,FALSE)*Assets!D8)","v":""},""]
["Healer",2,2,null,{"$f":"IF(OR(D9=0,D9=\"\"),\"\",VLOOKUP(A9,Info_Asset_Data,3,FALSE)*Assets!D9)","v":""},""]
["Lanista",2,2,null,{"$f":"IF(OR(D10=0,D10=\"\"),\"\",VLOOKUP(A10,Info_Asset_Data,3,FALSE)*Assets!D10)","v":""},""]
["Lotusmaster",1,1,null,{"$f":"IF(OR(D11=0,D11=\"\"),\"\",VLOOKUP(A11,Info_Asset_Data,3,FALSE)*Assets!D11)","v":""},""]
["Match-Fixer",2,2,null,{"$f":"IF(OR(D12=0,D12=\"\"),\"\",VLOOKUP(A12,Info_Asset_Data,3,FALSE)*Assets!D12)","v":""},"Single use"]
["Poisoner",1,3,null,{"$f":"IF(OR(D13=0,D13=\"\"),\"\",VLOOKUP(A13,Info_Asset_Data,3,FALSE)*Assets!D13)","v":""},"Hostile Asset"]
["Spy",1,2,null,{"$f":"IF(OR(D14=0,D14=\"\"),\"\",VLOOKUP(A14,Info_Asset_Data,3,FALSE)*Assets!D14)","v":""},"Hostile Asset"]
["Warlock",1,4,null,{"$f":"IF(OR(D15=0,D15=\"\"),\"\",VLOOKUP(A15,Info_Asset_Data,3,FALSE)*Assets!D15)","v":""},"Hostile Asset"]
["Mercenary",2,"Variable - See Roster",{"$f":"COUNTIF('Roster Selection'!B12:Y12,\"Y\")","v":0},{"$f":"IF(OR(D16=0,D16=\"\"),\"\",SUMIF('Roster Selection'!B12:Y12,\"Y\",RS_Value))","v":""},"Single use"]

{"sheet":"Custom Gladiators","index":4,"n_rows":49,"n_cols":7,"rows_kept":49}
["Default","Custom_Gladiator_1","Custom_Gladiator_2","Custom_Gladiator_3","Custom_Gladiator_4","Custom_Gladiator_5","Custom_Gladiator_6"]
["Tricarnian","N","N","N","N","N","N"]
["Combat Value",{"$f":"(((IF(B4<>\"\",VLOOKUP(B4,Info_Die_Types_Data,4,FALSE))+IF(B8<>\"\",VLOOKUP(B8,Info_Die_Types_Data,4,FALSE)))/2)+(B13+B14)+MAX(IF(B17<>\"\",VLOOKUP(B17,Info_Die_Types_Data,4,FALSE),0),IF(B22<>\"\",VLOOKUP(B22,Info_Die_Types_Data,4,FALSE),0),IF(B25<>\"\",VLOOKUP(B25,Info_Die_Types_Data,4,FALSE),0))+(((8-COUNTBLANK(B40:B47))+B48)*3))","v":0},0,0,0,0,0]
["Weapon Die"]
["Agility"]
["Smarts"]
["Spirit"]
["Strength"]
["Vigor"]
["Charisma"]
["Pace"]
["Parry"]
["Base Toughness"]
["Armour"]
["Toughness"]
["Driving"]
["Fighting"]
["Healing"]
["Intimdation"]
["Notice"]
["Riding"]
["Shooting"]
["Stealth"]
["Taunt"]
["Throwing"]
["Boating"]
["Climbing"]
["Driving"]
["Gambling"]
["Investigation"]
["Lockpicking"]
["Persuasion"]
["Piloting"]
["Repair"]
["Streetwise"]
["Survival"]
["Swimming"]
["Tracking"]
["Base Edges",{"$f":"IF(COUNTBLANK(B40:B47)=8,\"\",MID(CONCATENATE(B40,\", \",B41,\", \",B42,\", \",B43,\", \",B44,\", \",B45,\", \",B46,\", \",B47,\", \"),1,LEN(CONCATENATE(B40,B41,B42,B43,B44,B45,B46,B47))+((8-COUNTBLANK(B40:B47))*2)-2))","v":""}]
["Edge_1"]
["Edge_2"]
["Edge_3"]
["Edge_4"]
["Edge_5"]
["Edge_6"]
["Edge_7"]
["Edge_8"]
["No. Special Abilities"]
["Base Gear"]

{"sheet":"Reference","index":5,"n_rows":279,"n_cols":59,"rows_kept":279,"hidden":true}
["Type","Column","Wounds","Bennies","Wild Die","Multiplier","Injury Status","Die Types","Level","Lookup","Max","League Type","Area Points","Duration","RH","HC","WC","Celebrity",null,"Edges"]
["Extra",4,1,0,"N",1,"Dead","d4-2",0,{"$f":"H2","v":"d4-2"},2,"Quick Match",50,"Single battle","any","any",1,"d8"]
["Right-Hand",5,1,0,"Y",1.5,"Niggling Injury","d4",1,{"$f":"H3","v":"d4"},4,"Short League ",60,"4 Weeks long",2,2,2,2]
["Henchman",6,3,0,"N",2,"Wounded","d6",2,"d6",6,"Medium League",70,"8 Weeks long",3,3,2,3]
["Wild Card",7,3,1,"Y",3,"Uninjured","d8",3,"d8",8,"Long League",80,"12 Weeks long",4,4,3,4]
[{"$nulls":7},"d10",4,"d10",10]
[{"$nulls":7},"d12",5,"d12",12]
[{"$nulls":7},"d12+1",6,"d12+1",13]
[{"$nulls":7},"d12+2",7,"d12+2",14]
[{"$nulls":7},"d12+3",8,"d12+3",15]
["True / False","Team Type"]
["N","Regular"]
["Y","Tricarnian"]
[]
[]
["Gladiator","Tricarnian","Combat Value","Extra","Right-Hand","Henchman","Wild Card","Agility","Smarts","Spirit","Strength","Vigor","Charisma","Pace","Parry","Toughness","Driving","Fighting","Healing","Intimdation","Notice","Riding","Shooting","Stealth","Taunt","Throwing","Boating","Climbing","Gambling","Investigation","Lockpicking","Persuasion","Piloting","Repair","Streetwise","Survival","Swimming","Tracking","Base Edges","Base Gear","Weapon Die","Base toughness","Armour"]
["Bald Head ","Y",{"$f":"(((IF(AO17<>\"\",VLOOKUP(AO17,Info_Die_Types_Data,4,FALSE))+IF(K17<>\"\",VLOOKUP(K17,Info_Die_Types_Data,4,FALSE)))/2)+(AP17+AQ17)+MAX(IF(R17<>\"\",VLOOKUP(R17,Info_Die_Types_Data,4,FALSE),0),IF(W17<>\"\",VLOOKUP(W17,Info_Die_Types_Data,4,FALSE),0),IF(Z17<>\"\",VLOOKUP(Z17,Info_Die_Types_Data,4,FALSE),0))+(((LEN(AM17)-LEN(SUBSTITUTE(AM17,\",\",\"\")) ))*3))","v":35},4,6,8,12,"d8","d6","d6","d8","d8",0,6,8,"8 (2)",null,"d10","d6",null,"d6",null,"d6",null,null,"d6",{"$nulls":12},"Brute, Combat Reflexes, Frenzy, Tooth and Nail","Longsword (Str+d8), Medium Half Armour (+2), Medium Bladed Shield (+1 Parry)","d8",6,2]
["Beast Warrior","N",29,3,5,6,9,"d8","d6","d8","d6","d6",0,6,7,"6 (1)",null,"d8",null,"d6","d6",{"$nulls":3},"d6","d6",{"$nulls":12},"Block, Gladiator (Beast Warrior), Harras, Hold the Line!","Spear (Str+d6), Dagger (Str+d4), Light Armour (+1), Animal Companion","d6",5,1]
["Bone Wolf","N",25,3,5,6,9,"d8","d8 (A)","d6","d6","d6",0,8,6,5,null,"d8",null,null,"d6",{"$nulls":16},"d8","Bone Breaker, Fleet-Footed, Pack Tactics","Bite: Str+d6","d6",5]
["Desert Shrieker","N",24,2,3,4,6,"d8","d6 (A)","d6","d8","d6",0,8,6,"6 (1)",null,"d8",null,"d6","d6",{"$nulls":17},"Fleet-Footed, Reptile Reactions","Bite: Str+d6, AP1, Bony Plates - Armour (+1)","d6",5,1]
["Dominions Cat","N",24,2,3,4,6,"d10","d6 (A)","d8","d8","d8",0,6,7,6,null,"d8",null,null,"d8",null,null,"d10",{"$nulls":3},"d10",{"$nulls":10},"Pounce, Quick","Claws: Str+d6","d6",6]
["Bestiarius","N",30,3,5,6,9,"d8","d6","d6","d6","d8",0,6,7,"7 (1)",null,"d8",null,"d6","d6",{"$nulls":4},"d6",{"$nulls":9},"d6",null,null,"Combat Reflexes, First Strike, Gladiator (Bestiarius), Quick","Spear (Str+d6, Reach 1), Light Armour (+1), Medium Shield (+1 Parry)","d6",6,1]
["Blind Mauler","Y",37,4,6,8,12,"d6","d6","d8","d10","d10",0,6,6,8,null,"d10",null,null,"d8",{"$nulls":16},"d8","Alertness, Improved Sweep, Size +1, Extended Perception","Maul (Str+d10, AP1, -1 Parry, 2H), Blind Helm (+3, causes Blind)","d10",8]
["Bull Dancer","N",28,3,5,6,9,"d10","d6","d8","d6","d6",2,6,7,5,null,"d8",null,null,"d6","d8",null,null,"d8",{"$nulls":6},"d8",{"$nulls":6},"Acrobat, Attractive, Fleet-Footed- Gladiator (Bull Dancer), Luck, Quick","Red Leather bikini",null,5]
["Caldeian Fencer","N",35,4,6,8,12,"d8","d8 (A)","d6","d8","d6",0,6,9,"6 (1)",null,"d10",null,"d6","d6","d6",null,null,"d6",{"$nulls":6},"d6",{"$nulls":6},"Beat Back, Block, Command, Gladiator (Caldeian Fencer), First Strike","Caldeian Sabre (Str+d6), Caldeian Dagger (Str+d4, +1 Parry), Caldeian Officer's Helm (+2), Light Armour (+1)","d6",5,1]
["Caled Spearman","N",29,3,5,6,9,"d8","d6","d6","d8","d8",0,6,7,6,null,"d10",null,"d8","d6",{"$nulls":4},"d6",{"$nulls":12},"Block, Gladiator (Caled Spearman), Sweep","Spear (Str+d6, +1 Parry, Reach 2, 2H), loincloth, tattoos","d6",6]
["Cavalryman","N",29,3,5,6,9,"d8","d6","d6","d6","d6",0,6,7,"6 (1)",null,"d8",null,null,"d6","d8",{"$nulls":3},"d6",{"$nulls":12},"Block, Combat Reflexes, Dodge, Gladiator (Cavalryman)","Spear (Str+d6, Reach 1), Small Shield (+1 Parry), Light armour (+1), Riding Horse","d6",5,1]
["Chain Fighter","N",30,3,5,6,9,"d6","d6","d6","d8","d8",0,5,6,"8 (2)","d4","d8",null,"d8","d6",{"$nulls":3},"d6",{"$nulls":13},"Block, Death Grip, Gladiator (Chain Fighter)","Arena Chain (Str+d8, Reach 2, Ignore Parry bonus, -1 parry, 2H), Hooked Half Medium Armour (+2, +1 if hit with Raise)","d8",6,2]
["Charioteer Archer ","N",28,3,5,6,9,"d8","d6","d8","d6","d6",0,5,5,"6 (1)","d4","d6",{"$nulls":4},"d10",null,"d8",{"$nulls":13},"Dodge, Marksman, Trained Thrower (Bow)","Bow (2d6, 12/24/48), Dagger (Str+d4), Light Armour (+1)","d6",5,1]
["Charioteer","N",21,2,3,4,6,"d8","d6","d8","d6","d6",0,5,5,"6 (1)","d8","d6",{"$nulls":20},"Charioteer, Improved Dodge, Steady Hands","Whip (Str, Reach 2), Light Armour (+1), Small Shield (+1 Parry), Arena Chariot (see GE page 101), 2 Horses",null,5,1]
["Common Gladiator","N",24,2,3,4,6,"d8","d6","d6","d8","d6",0,6,7,"6 (1)",null,"d8",null,null,"d6",{"$nulls":3},"d6","d6",{"$nulls":12},"First Strike, Gladiator (Retired)","Spear (Str+d6, Reach 1), Light Armour (+1), Medium Shield (+1 Parry)","d6",5,1]
["Disk Thrower","N",31,3,5,6,9,"d8","d6","d6","d6","d8",0,6,6,6,null,"d6",null,null,"d6",{"$nulls":3},"d6","d10",{"$nulls":12},"Ambidexterity, Gladiator (Disk Thrower), Two Fisted, Quick Draw","4 x Chakram (Str+d4, 6/12/24), 2 x Spiked Chakram (Str+d4, 4/8/16, -1 Throwing, +1 damage & +1 Parry in melee)","d6",6]
["Myrmidon","N",34,3,5,6,9,"d6","d6","d6","d8","d8",0,5,9,"9 (3)",null,"d8",null,"d8","d6",{"$nulls":3},"d6",{"$nulls":13},"Block, Counterattack, Gladiator (Myrmidon), Sweep","Longsword (Str+d8), Large Shield (+2 Parry), Heavy Armour (+3), Gladiator Helm (+3, -1 Notice)","d8",6,3]
["Pugilist","N",29,3,5,6,9,"d8","d6","d6","d8","d8",0,6,7,6,null,"d8",null,"d8","d6",{"$nulls":3},"d8",{"$nulls":13},"Brawler, Gladiator (Pugulist), Improved Frenzy, Iron Will","Iron Fist (Str+d4+2), Small Shield (+1 Parry)","d4",6]
["Retiarius","N",30,3,5,6,9,"d8","d6","d6","d6","d6",0,6,8,5,null,"d10",null,null,"d8",{"$nulls":3},"d8",{"$nulls":13},"Ambidexterity, Block, Death Grip, Gladiator (Retiarius)","Trident (Str+d6, Reach 1), Combat Net (+2 to Grapple rolls, Reach 2) Gladiator Helm (+3, -1 to Notice rolls)","d6",5]
["Skirmisher","N",30,3,5,6,9,"d10","d6","d6","d6","d6",0,8,6,5,null,"d6",null,null,"d6",null,"d10",null,"d8",{"$nulls":13},"Fleet-Footed, Extraction, Gladiator (Skirmisher), Steady Hands","Bow (2d6, 12/24/48), Gladiator armguard (+1 Parry), Leather Greaves (+1 Legs only)","d6",5]
["Spear Runner","N",27,3,5,6,9,"d8","d6","d6","d8","d8",0,8,7,6,null,"d8",null,null,"d6",{"$nulls":3},"d6","d8",{"$nulls":12},"Fleet-Footed, Gladiator (Spear Runner), Improved Frenzy","Spear (Str+d6, +1 Parry, Reach 2, 2H), 3 x Javelins (Str+d6, 4/8/16), loincloth","d6",6]
["Scythed Death Char.","N",33,3,5,6,9,"d8","d8 (A)","d8","d6","d6",0,5,6,"7 (2)","d8","d8",null,"d6","d6",{"$nulls":4},"d8",{"$nulls":12},"Chariotter, Death Grip, Level Headed, Steady Hands, Drag Along the Ground, Slashing Death","Long Whip (Str, Reach 4), Medium Armour (+2), Arena Chariot (see GE p101), 2 x Horses",null,5,2]
["Sweet Death","Y",40,4,6,8,12,"d8","d8 (A)","d6","d6","d8",2,6,7,"8 (2)",null,"d8",null,null,"d6",null,null,"d6",null,"d8",null,"d4",{"$nulls":3},"d8",null,null,"d6",{"$nulls":3},"Attractive, Dodge, First Strike, Rain of Steel, Pleasure Girl, Poisonous Saliva, Poison Resistance","Short Sword (Str+d6), Small Shield (+1 Parry), Medium Armour (+2), 3 x Throwing Dagger (Str+d4, 3/6/9, +1 Throwing, -1 Fighting)","d6",6,2]
["Swordsman","N",30,3,5,6,9,"d8","d6","d6","d8","d8",0,6,9,6,null,"d8",null,"d8","d6",{"$nulls":3},"d6",{"$nulls":13},"Block, Counterattack, Distract, Gladiator (Swordsman)","Short Sword (str+d6), Medium Shield (+2 Parry), Gladiator armguard (+1 Parry), Gladiator Helm (+3, -1 Notice rolls)","d6",6]
["Tusk Fighter","N",35,4,6,8,12,"d8","d4","d6","d8","d10",0,6,7,7,null,"d10",null,"d8","d6",{"$nulls":17},"Combat Reflexes, Gladiator (Tusk Fighter), Nerves of Steel, Tooth and Nail, Two-Fisted","2 x Iron Fists (Str+d4), Gladiator Helm (+3, -1 Notice rolls)","d4",7]
["Twin Master","N",32,3,5,6,9,"d10","d6","d6","d6","d6",0,6,8,5,null,"d10","d6","d6",{"$nulls":3},"d6","d6","d6",{"$nulls":12},"Acrobat, Ambidexterity, Distract, Gladiator (Twin Master), Two Fisted","2 x Dagger (Str+d4)","d4",5]
["Custom_Gladiator_1",{"$f":"IF(VLOOKUP(B$16,Custom_Gladiator_Data,2,FALSE)=\"\",\"\",VLOOKUP(B$16,Custom_Gladiator_Data,2,FALSE))","v":"N"},{"$f":"IF(VLOOKUP(C$16,Custom_Gladiator_Data,2,FALSE)=\"\",\"\",VLOOKUP(C$16,Custom_Gladiator_Data,2,FALSE))","v":0},{"$f":"IF(D$16<>\"\",VLOOKUP(D$16,Info_Type_Data,6,FALSE),\"N/A\")*IF($C43<>\"\",ROUND($C43/10,0),0)","v":0},0,0,0,{"$f":"IF(VLOOKUP(H$16,Custom_Gladiator_Data,2,FALSE)=\"\",\"\",VLOOKUP(H$16,Custom_Gladiator_Data,2,FALSE))","v":""},"","","","","","","","","","","","","","","","","","","","","","","","","","","","","","","",""]
["Custom_Gladiator_2","N",{"$f":"IF(VLOOKUP(C$16,Custom_Gladiator_Data,3,FALSE)=\"\",\"\",VLOOKUP(C$16,Custom_Gladiator_Data,3,FALSE))","v":0},0,0,0,0,{"$f":"IF(VLOOKUP(H$16,Custom_Gladiator_Data,3,FALSE)=\"\",\"\",VLOOKUP(H$16,Custom_Gladiator_Data,3,FALSE))","v":""},"","","","","","","","","","","","","","","","","","","","","","","","","","","","","","","",""]
["Custom_Gladiator_3","N",{"$f":"IF(VLOOKUP(C$16,Custom_Gladiator_Data,4,FALSE)=\"\",\"\",VLOOKUP(C$16,Custom_Gladiator_Data,4,FALSE))","v":0},0,0,0,0,{"$f":"IF(VLOOKUP(H$16,Custom_Gladiator_Data,4,FALSE)=\"\",\"\",VLOOKUP(H$16,Custom_Gladiator_Data,4,FALSE))","v":""},"","","","","","","","","","","","","","","","","","","","","","","","","","","","","","","",""]
["Custom_Gladiator_4","N",{"$f":"IF(VLOOKUP(C$16,Custom_Gladiator_Data,5,FALSE)=\"\",\"\",VLOOKUP(C$16,Custom_Gladiator_Data,5,FALSE))","v":0},0,0,0,0,{"$f":"IF(VLOOKUP(H$16,Custom_Gladiator_Data,5,FALSE)=\"\",\"\",VLOOKUP(H$16,Custom_Gladiator_Data,5,FALSE))","v":""},"","","","","","","","","","","","","","","","","","","","","","","","","","","","","","","",""]
["Custom_Gladiator_5","N",{"$f":"IF(VLOOKUP(C$16,Custom_Gladiator_Data,6,FALSE)=\"\",\"\",VLOOKUP(C$16,Custom_Gladiator_Data,6,FALSE))","v":0},0,0,0,0,{"$f":"IF(VLOOKUP(H$16,Custom_Gladiator_Data,6,FALSE)=\"\",\"\",VLOOKUP(H$16,Custom_Gladiator_Data,6,FALSE))","v":""},"","","","","","","","","","","","","","","","","","","","","","","","","","","","","","","",""]
["Custom_Gladiator_6","N",{"$f":"IF(VLOOKUP(C$16,Custom_Gladiator_Data,7,FALSE)=\"\",\"\",VLOOKUP(C$16,Custom_Gladiator_Data,7,FALSE))","v":0},0,0,0,0,{"$f":"IF(VLOOKUP(H$16,Custom_Gladiator_Data,7,FALSE)=\"\",\"\",VLOOKUP(H$16,Custom_Gladiator_Data,7,FALSE))","v":""},"","","","","","","","","","","","","","","","","","","","","","","","","","","","","","","",""]
[]
[]
["BASE",1,2,3,4,5,6,7,8,9,10,11,12,null,null,"MOD",1,2,3,4,5,6,7,8,9,10,11,12,null,null,"Combined",1,2,3,4,5,6,7,8,9,10,11,12,null,null,"ROSTER",1,2,3,4,5,6,7,8,9,10,11,12]
["Name",{"$f":"IF(OR(ISERROR(VLOOKUP($A52,RS_Roster,MATCH(B$51,RS_Roster_Position,0),FALSE)),VLOOKUP($A52,RS_Roster,MATCH(B$51,RS_Roster_Position,0),FALSE)=\"\"),\"\",VLOOKUP($A52,RS_Roster,MATCH(B$51,RS_Roster_Position,0),FALSE))","v":""},"","","","","","","","","","","",null,null,"Name",{"$nulls":14},"Name",{"$f":"B52","v":""},"","","","","","","","","","","",null,null,"Name",{"$f":"AF52","v":""},"","","","","","","","","","",""]
["Gladiator Role","","","","","","","","","","","","",null,null,"Gladiator Role",{"$nulls":14},"Gladiator Role","","","","","","","","","","","","",null,null,"Gladiator Role",{"$f":"AF53","v":""},{"$f":"AG53","v":""},"","","","","","","","","",""]
["Type","","","","","","","","","","","","",null,null,"Type",{"$nulls":14},"Type","","","","","","","","","","","","",null,null,"Type","","","","","","","","","","","",""]
["Mercenary","N","N","N","N","N","N","N","N","N","N","N","N",null,null,"Mercenary",{"$nulls":14},"Mercenary",{"$f":"B55","v":"N"},{"$f":"C55","v":"N"},{"$f":"D55","v":"N"},{"$f":"E55","v":"N"},{"$f":"F55","v":"N"},{"$f":"G55","v":"N"},{"$f":"H55","v":"N"},{"$f":"I55","v":"N"},{"$f":"J55","v":"N"},{"$f":"K55","v":"N"},{"$f":"L55","v":"N"},{"$f":"M55","v":"N"},null,null,"Mercenary","N","N","N","N","N","N","N","N","N","N","N","N"]
["Value","","","","","","","","","","","","",null,null,"Value",{"$nulls":14},"Value","","","","","","","","","","","","",null,null,"Cost","","","","","","","","","","","",""]
["Wounds","","","","","","","","","","","","",null,null,"Wounds",{"$nulls":14},"Wounds",{"$f":"IF(B57=\"\",0,B57)+Q57","v":0},{"$f":"IF(C57=\"\",0,C57)+R57","v":0},{"$f":"IF(D57=\"\",0,D57)+S57","v":0},{"$f":"IF(E57=\"\",0,E57)+T57","v":0},{"$f":"IF(F57=\"\",0,F57)+U57","v":0},{"$f":"IF(G57=\"\",0,G57)+V57","v":0},{"$f":"IF(H57=\"\",0,H57)+W57","v":0},{"$f":"IF(I57=\"\",0,I57)+X57","v":0},{"$f":"IF(J57=\"\",0,J57)+Y57","v":0},{"$f":"IF(K57=\"\",0,K57)+Z57","v":0},{"$f":"IF(L57=\"\",0,L57)+AA57","v":0},{"$f":"IF(M57=\"\",0,M57)+AB57","v":0},null,null,"Wounds",{"$f":"AF57","v":0},{"$f":"AG57","v":0},{"$f":"AH57","v":0},{"$f":"AI57","v":0},{"$f":"AJ57","v":0},{"$f":"AK57","v":0},{"$f":"AL57","v":0},{"$f":"AM57","v":0},{"$f":"AN57","v":0},{"$f":"AO57","v":0},{"$f":"AP57","v":0},{"$f":"AQ57","v":0}]
["Bennies",0,0,0,0,0,0,0,0,0,0,0,0,null,null,"Bennies",{"$f":"IF(OR(ISERROR(VLOOKUP($A58,RS_Roster,MATCH(Q$51,RS_Roster_Position,0)+1,FALSE)),VLOOKUP($A58,RS_Roster,MATCH(Q$51,RS_Roster_Position,0)+1,FALSE)=\"\"),0,VLOOKUP($A58,RS_Roster,MATCH(Q$51,RS_Roster_Position,0)+1,FALSE))","v":0},0,0,0,0,0,0,0,0,0,0,0,null,null,"Bennies",{"$f":"IF(B58=\"\",0,B58)+Q58","v":0},{"$f":"IF(C58=\"\",0,C58)+R58","v":0},0,0,0,0,0,0,0,0,0,0,null,null,"Bennies",{"$f":"AF58","v":0},0,0,0,0,0,0,0,0,0,0,0]
["Kill Points","0 / 0",0,0,0,0,0,0,0,0,0,0,0,null,null,"Kill Points",{"$nulls":14},"Kill Points",{"$f":"B59","v":"0 / 0"},0,0,0,0,0,0,0,0,0,0,0,null,null,"Kill Points","0 / 0",{"$f":"AG59","v":0},0,0,0,0,0,0,0,0,0,0]
["Injury Status","Uninjured","Uninjured","Uninjured","Uninjured","Uninjured","Uninjured","Uninjured","Uninjured","Uninjured","Uninjured","Uninjured","Uninjured",null,null,"Injury Status",{"$nulls":14},"Injury Status","Uninjured","Uninjured","Uninjured","Uninjured","Uninjured","Uninjured","Uninjured","Uninjured","Uninjured","Uninjured","Uninjured","Uninjured",null,null,"Injury Status","Uninjured","Uninjured","Uninjured","Uninjured","Uninjured","Uninjured","Uninjured","Uninjured","Uninjured","Uninjured","Uninjured","Uninjured"]
[{"$nulls":30},"ATTRIBUTES",{"$nulls":14},"ATTRIBUTES",{"$f":"IF(COUNTBLANK(AU62:AU66)=5,\"\",MID(CONCATENATE(AU62,AU63,AU64,AU65,AU66),1,LEN(CONCATENATE(AU62,AU63,AU64,AU65,AU66))-2))","v":""},{"$f":"IF(COUNTBLANK(AV62:AV66)=5,\"\",MID(CONCATENATE(AV62,AV63,AV64,AV65,AV66),1,LEN(CONCATENATE(AV62,AV63,AV64,AV65,AV66))-2))","v":""},{"$f":"IF(COUNTBLANK(AW62:AW66)=5,\"\",MID(CONCATENATE(AW62,AW63,AW64,AW65,AW66),1,LEN(CONCATENATE(AW62,AW63,AW64,AW65,AW66))-2))","v":""},"","","","","","","","",""]
["Agility",{"$f":"IF(OR(ISERROR(VLOOKUP($A62,RS_Roster,MATCH(B$51,RS_Roster_Position,0),FALSE)),VLOOKUP($A62,RS_Roster,MATCH(B$51,RS_Roster_Position,0),FALSE)=\"\"),\"\",VLOOKUP($A62,RS_Roster,MATCH(B$51,RS_Roster_Position,0),FALSE))","v":""},"","","","","","","","","","","",null,null,"Agility",{"$f":"IF(OR(ISERROR(VLOOKUP($A62,RS_Roster,MATCH(Q$51,RS_Roster_Position,0)+1,FALSE)),VLOOKUP($A62,RS_Roster,MATCH(Q$51,RS_Roster_Position,0)+1,FALSE)=\"\"),0,VLOOKUP($A62,RS_Roster,MATCH(Q$51,RS_Roster_Position,0)+1,FALSE))","v":0},0,0,0,0,0,0,0,0,0,0,0,null,null,"Agility",{"$f":"IF(ISERROR(VLOOKUP(IF(OR(ISERROR(B62),B62=\"\"),\"\",VLOOKUP(IF(ISERROR(SEARCH(\"(A)\",B62,1)),B62,MID(B62,1,SEARCH(\"(A)\",B62,1)-2)),Info_Die_Types_Data,2,FALSE))+Q62,Info_Die_Types_Conversion,2,FALSE)),\"\",$AE62&\" \"&VLOOKUP(IF(OR(ISERROR(B62),B62=\"\"),\"\",VLOOKUP(IF(ISERROR(SEARCH(\"(A)\",B62,1)),B62,MID(B62,1,SEARCH(\"(A)\",B62,1)-2)),Info_Die_Types_Data,2,FALSE))+Q62,Info_Die_Types_Conversion,2,FALSE)&IF(ISERROR(SEARCH(\"(A)\",B62,1)),\"\",\" (A)\")&\", \")","v":""},"","","","","","","","","","","",null,null,"Agility","",{"$f":"AG62","v":""},{"$f":"AH62","v":""},{"$f":"AI62","v":""},{"$f":"AJ62","v":""},{"$f":"AK62","v":""},{"$f":"AL62","v":""},{"$f":"AM62","v":""},{"$f":"AN62","v":""},{"$f":"AO62","v":""},{"$f":"AP62","v":""},{"$f":"AQ62","v":""}]
["Smarts","","","","","","","","","","","","",null,null,"Smarts",0,0,0,0,0,0,0,0,0,0,0,0,null,null,"Smarts","","","","","","","","","","","","",null,null,"Smarts","","","","","","","","","","","",""]
["Spirit","","","","","","","","","","","","",null,null,"Spirit",0,0,0,0,0,0,0,0,0,0,0,0,null,null,"Spirit","","","","","","","","","","","","",null,null,"Spirit","","","","","","","","","","","",""]
["Strength","","","","","","","","","","","","",null,null,"Strength",0,0,0,0,0,0,0,0,0,0,0,0,null,null,"Strength","","","","","","","","","","","","",null,null,"Strength","","","","","","","","","","","",""]
["Vigor","","","","","","","","","","","","",null,null,"Vigor",0,0,0,0,0,0,0,0,0,0,0,0,null,null,"Vigor","","","","","","","","","","","","",null,null,"Vigor","","","","","","","","","","","",""]
["Charisma","","","","","","","","","","","","",null,null,"Charisma",0,0,0,0,0,0,0,0,0,0,0,0,null,null,"Charisma",{"$f":"IF(B67=\"\",0,B67)+Q67","v":0},{"$f":"IF(C67=\"\",0,C67)+R67","v":0},{"$f":"IF(D67=\"\",0,D67)+S67","v":0},{"$f":"IF(E67=\"\",0,E67)+T67","v":0},{"$f":"IF(F67=\"\",0,F67)+U67","v":0},{"$f":"IF(G67=\"\",0,G67)+V67","v":0},{"$f":"IF(H67=\"\",0,H67)+W67","v":0},{"$f":"IF(I67=\"\",0,I67)+X67","v":0},{"$f":"IF(J67=\"\",0,J67)+Y67","v":0},{"$f":"IF(K67=\"\",0,K67)+Z67","v":0},{"$f":"IF(L67=\"\",0,L67)+AA67","v":0},{"$f":"IF(M67=\"\",0,M67)+AB67","v":0},null,null,"Cha.",0,{"$f":"AG67","v":0},0,0,0,0,0,0,0,0,0,0]
["Pace",{"$f":"IF(OR(ISERROR(VLOOKUP($A68,RS_Roster,MATCH(B$51,RS_Roster_Position,0),FALSE)),VLOOKUP($A68,RS_Roster,MATCH(B$51,RS_Roster_Position,0),FALSE)=\"\"),0,VLOOKUP($A68,RS_Roster,MATCH(B$51,RS_Roster_Position,0),FALSE))","v":0},0,0,0,0,0,0,0,0,0,0,0,null,null,"Pace",0,0,0,0,0,0,0,0,0,0,0,0,null,null,"Pace",0,0,0,0,0,0,0,0,0,0,0,0,null,null,"Pace",0,0,0,0,0,0,0,0,0,0,0,0]
["Parry",0,0,0,0,0,0,0,0,0,0,0,0,null,null,"Parry",0,0,0,0,0,0,0,0,0,0,0,0,null,null,"Parry",0,0,0,0,0,0,0,0,0,0,0,0,null,null,"Parry",0,0,0,0,0,0,0,0,0,0,0,0]
["Toughness",0,0,0,0,0,0,0,0,0,0,0,0,null,null,"Toughness",0,0,0,0,0,0,0,0,0,0,0,0,null,null,"Toughness",{"$f":"IF(ISERROR(SEARCH(\"(\",B70,1)),B70+Q70,VALUE(MID(B70,1,SEARCH(\"(\",B70,1)-2)+Q70)&MID(B70,SEARCH(\"(\",B70,1)-1,LEN(B70)-SEARCH(\"(\",B70,1)+2))","v":0},{"$f":"IF(ISERROR(SEARCH(\"(\",C70,1)),C70+R70,VALUE(MID(C70,1,SEARCH(\"(\",C70,1)-2)+R70)&MID(C70,SEARCH(\"(\",C70,1)-1,LEN(C70)-SEARCH(\"(\",C70,1)+2))","v":0},0,{"$f":"IF(ISERROR(SEARCH(\"(\",E70,1)),E70+T70,VALUE(MID(E70,1,SEARCH(\"(\",E70,1)-2)+T70)&MID(E70,SEARCH(\"(\",E70,1)-1,LEN(E70)-SEARCH(\"(\",E70,1)+2))","v":0},0,0,0,0,0,0,0,0,null,null,"Tough.",0,0,0,0,0,0,0,0,0,0,0,0]
[{"$nulls":30},"SKILLS",{"$nulls":14},"SKILLS",{"$f":"IF(COUNTBLANK(AU72:AU93)=22,\"\",MID(CONCATENATE(AU72,AU73,AU74,AU75,AU76,AU77,AU78,AU79,AU80,AU81,AU82,AU83,AU84,AU85,AU86,AU87,AU88,AU89,AU90,AU91,AU92,AU93),1,LEN(CONCATENATE(AU72,AU73,AU74,AU75,AU76,AU77,AU78,AU79,AU80,AU81,AU82,AU83,AU84,AU85,AU86,AU87,AU88,AU89,AU90,AU91,AU92,AU93))-2))","v":""},{"$f":"IF(COUNTBLANK(AV72:AV93)=22,\"\",MID(CONCATENATE(AV72,AV73,AV74,AV75,AV76,AV77,AV78,AV79,AV80,AV81,AV82,AV83,AV84,AV85,AV86,AV87,AV88,AV89,AV90,AV91,AV92,AV93),1,LEN(CONCATENATE(AV72,AV73,AV74,AV75,AV76,AV77,AV78,AV79,AV80,AV81,AV82,AV83,AV84,AV85,AV86,AV87,AV88,AV89,AV90,AV91,AV92,AV93))-2))","v":""},{"$f":"IF(COUNTBLANK(AW72:AW93)=22,\"\",MID(CONCATENATE(AW72,AW73,AW74,AW75,AW76,AW77,AW78,AW79,AW80,AW81,AW82,AW83,AW84,AW85,AW86,AW87,AW88,AW89,AW90,AW91,AW92,AW93),1,LEN(CONCATENATE(AW72,AW73,AW74,AW75,AW76,AW77,AW78,AW79,AW80,AW81,AW82,AW83,AW84,AW85,AW86,AW87,AW88,AW89,AW90,AW91,AW92,AW93))-2))","v":""},"","","","","","","","",""]
["Driving",{"$f":"IF(OR(ISERROR(VLOOKUP($A72,RS_Roster,MATCH(B$51,RS_Roster_Position,0),FALSE)),VLOOKUP($A72,RS_Roster,MATCH(B$51,RS_Roster_Position,0),FALSE)=\"\"),\"d4-2\",VLOOKUP($A72,RS_Roster,MATCH(B$51,RS_Roster_Position,0),FALSE))","v":"d4-2"},"d4-2","d4-2","d4-2","d4-2","d4-2","d4-2","d4-2","d4-2","d4-2","d4-2","d4-2",null,null,"Driving",{"$f":"IF(OR(ISERROR(VLOOKUP($A72,RS_Roster,MATCH(Q$51,RS_Roster_Position,0)+1,FALSE)),VLOOKUP($A72,RS_Roster,MATCH(Q$51,RS_Roster_Position,0)+1,FALSE)=\"\"),0,VLOOKUP($A72,RS_Roster,MATCH(Q$51,RS_Roster_Position,0)+1,FALSE))","v":0},0,0,0,0,0,0,0,0,0,0,0,null,null,"Driving",{"$f":"IF(AND(ISERROR(VLOOKUP(IF(OR(ISERROR(B72),B72=\"d4-2\"),\"\",VLOOKUP(B72,Info_Die_Types_Data,2,FALSE))+Q72,Info_Die_Types_Conversion,2,FALSE)),Q72=0),\"\",$AE72&\" \"&VLOOKUP(IF(OR(ISERROR(B72),B72=\"\"),\"\",VLOOKUP(B72,Info_Die_Types_Data,2,FALSE))+Q72,Info_Die_Types_Conversion,2,FALSE)&\", \")","v":""},{"$f":"IF(AND(ISERROR(VLOOKUP(IF(OR(ISERROR(C72),C72=\"d4-2\"),\"\",VLOOKUP(C72,Info_Die_Types_Data,2,FALSE))+R72,Info_Die_Types_Conversion,2,FALSE)),R72=0),\"\",$AE72&\" \"&VLOOKUP(IF(OR(ISERROR(C72),C72=\"\"),\"\",VLOOKUP(C72,Info_Die_Types_Data,2,FALSE))+R72,Info_Die_Types_Conversion,2,FALSE)&\", \")","v":""},{"$f":"IF(AND(ISERROR(VLOOKUP(IF(OR(ISERROR(D72),D72=\"d4-2\"),\"\",VLOOKUP(D72,Info_Die_Types_Data,2,FALSE))+S72,Info_Die_Types_Conversion,2,FALSE)),S72=0),\"\",$AE72&\" \"&VLOOKUP(IF(OR(ISERROR(D72),D72=\"\"),\"\",VLOOKUP(D72,Info_Die_Types_Data,2,FALSE))+S72,Info_Die_Types_Conversion,2,FALSE)&\", \")","v":""},{"$f":"IF(AND(ISERROR(VLOOKUP(IF(OR(ISERROR(E72),E72=\"d4-2\"),\"\",VLOOKUP(E72,Info_Die_Types_Data,2,FALSE))+T72,Info_Die_Types_Conversion,2,FALSE)),T72=0),\"\",$AE72&\" \"&VLOOKUP(IF(OR(ISERROR(E72),E72=\"\"),\"\",VLOOKUP(E72,Info_Die_Types_Data,2,FALSE))+T72,Info_Die_Types_Conversion,2,FALSE)&\", \")","v":""},{"$f":"IF(AND(ISERROR(VLOOKUP(IF(OR(ISERROR(F72),F72=\"d4-2\"),\"\",VLOOKUP(F72,Info_Die_Types_Data,2,FALSE))+U72,Info_Die_Types_Conversion,2,FALSE)),U72=0),\"\",$AE72&\" \"&VLOOKUP(IF(OR(ISERROR(F72),F72=\"\"),\"\",VLOOKUP(F72,Info_Die_Types_Data,2,FALSE))+U72,Info_Die_Types_Conversion,2,FALSE)&\", \")","v":""},{"$f":"IF(AND(ISERROR(VLOOKUP(IF(OR(ISERROR(G72),G72=\"d4-2\"),\"\",VLOOKUP(G72,Info_Die_Types_Data,2,FALSE))+V72,Info_Die_Types_Conversion,2,FALSE)),V72=0),\"\",$AE72&\" \"&VLOOKUP(IF(OR(ISERROR(G72),G72=\"\"),\"\",VLOOKUP(G72,Info_Die_Types_Data,2,FALSE))+V72,Info_Die_Types_Conversion,2,FALSE)&\", \")","v":""},{"$f":"IF(AND(ISERROR(VLOOKUP(IF(OR(ISERROR(H72),H72=\"d4-2\"),\"\",VLOOKUP(H72,Info_Die_Types_Data,2,FALSE))+W72,Info_Die_Types_Conversion,2,FALSE)),W72=0),\"\",$AE72&\" \"&VLOOKUP(IF(OR(ISERROR(H72),H72=\"\"),\"\",VLOOKUP(H72,Info_Die_Types_Data,2,FALSE))+W72,Info_Die_Types_Conversion,2,FALSE)&\", \")","v":""},{"$f":"IF(AND(ISERROR(VLOOKUP(IF(OR(ISERROR(I72),I72=\"d4-2\"),\"\",VLOOKUP(I72,Info_Die_Types_Data,2,FALSE))+X72,Info_Die_Types_Conversion,2,FALSE)),X72=0),\"\",$AE72&\" \"&VLOOKUP(IF(OR(ISERROR(I72),I72=\"\"),\"\",VLOOKUP(I72,Info_Die_Types_Data,2,FALSE))+X72,Info_Die_Types_Conversion,2,FALSE)&\", \")","v":""},{"$f":"IF(AND(ISERROR(VLOOKUP(IF(OR(ISERROR(J72),J72=\"d4-2\"),\"\",VLOOKUP(J72,Info_Die_Types_Data,2,FALSE))+Y72,Info_Die_Types_Conversion,2,FALSE)),Y72=0),\"\",$AE72&\" \"&VLOOKUP(IF(OR(ISERROR(J72),J72=\"\"),\"\",VLOOKUP(J72,Info_Die_Types_Data,2,FALSE))+Y72,Info_Die_Types_Conversion,2,FALSE)&\", \")","v":""},{"$f":"IF(AND(ISERROR(VLOOKUP(IF(OR(ISERROR(K72),K72=\"d4-2\"),\"\",VLOOKUP(K72,Info_Die_Types_Data,2,FALSE))+Z72,Info_Die_Types_Conversion,2,FALSE)),Z72=0),\"\",$AE72&\" \"&VLOOKUP(IF(OR(ISERROR(K72),K72=\"\"),\"\",VLOOKUP(K72,Info_Die_Types_Data,2,FALSE))+Z72,Info_Die_Types_Conversion,2,FALSE)&\", \")","v":""},{"$f":"IF(AND(ISERROR(VLOOKUP(IF(OR(ISERROR(L72),L72=\"d4-2\"),\"\",VLOOKUP(L72,Info_Die_Types_Data,2,FALSE))+AA72,Info_Die_Types_Conversion,2,FALSE)),AA72=0),\"\",$AE72&\" \"&VLOOKUP(IF(OR(ISERROR(L72),L72=\"\"),\"\",VLOOKUP(L72,Info_Die_Types_Data,2,FALSE))+AA72,Info_Die_Types_Conversion,2,FALSE)&\", \")","v":""},{"$f":"IF(AND(ISERROR(VLOOKUP(IF(OR(ISERROR(M72),M72=\"d4-2\"),\"\",VLOOKUP(M72,Info_Die_Types_Data,2,FALSE))+AB72,Info_Die_Types_Conversion,2,FALSE)),AB72=0),\"\",$AE72&\" \"&VLOOKUP(IF(OR(ISERROR(M72),M72=\"\"),\"\",VLOOKUP(M72,Info_Die_Types_Data,2,FALSE))+AB72,Info_Die_Types_Conversion,2,FALSE)&\", \")","v":""},null,1,"Driving",{"$f":"IF(ISERROR(INDEX(AF$71:AF$93,SMALL(IF(AF$71:AF$93<>\"\",ROW(AF$71:AF$93)-ROW(AF$71)+1,\"\"),$AS72))),\"\",INDEX(AF$71:AF$93,SMALL(IF(AF$71:AF$93<>\"\",ROW(AF$71:AF$93)-ROW(AF$71)+1,\"\"),$AS72)))","v":""},{"$f":"IF(ISERROR(INDEX(AG$71:AG$93,SMALL(IF(AG$71:AG$93<>\"\",ROW(AG$71:AG$93)-ROW(AG$71)+1,\"\"),$AS72))),\"\",INDEX(AG$71:AG$93,SMALL(IF(AG$71:AG$93<>\"\",ROW(AG$71:AG$93)-ROW(AG$71)+1,\"\"),$AS72)))","v":""},{"$f":"IF(ISERROR(INDEX(AH$71:AH$93,SMALL(IF(AH$71:AH$93<>\"\",ROW(AH$71:AH$93)-ROW(AH$71)+1,\"\"),$AS72))),\"\",INDEX(AH$71:AH$93,SMALL(IF(AH$71:AH$93<>\"\",ROW(AH$71:AH$93)-ROW(AH$71)+1,\"\"),$AS72)))","v":""},{"$f":"IF(ISERROR(INDEX(AI$71:AI$93,SMALL(IF(AI$71:AI$93<>\"\",ROW(AI$71:AI$93)-ROW(AI$71)+1,\"\"),$AS72))),\"\",INDEX(AI$71:AI$93,SMALL(IF(AI$71:AI$93<>\"\",ROW(AI$71:AI$93)-ROW(AI$71)+1,\"\"),$AS72)))","v":""},{"$f":"IF(ISERROR(INDEX(AJ$71:AJ$93,SMALL(IF(AJ$71:AJ$93<>\"\",ROW(AJ$71:AJ$93)-ROW(AJ$71)+1,\"\"),$AS72))),\"\",INDEX(AJ$71:AJ$93,SMALL(IF(AJ$71:AJ$93<>\"\",ROW(AJ$71:AJ$93)-ROW(AJ$71)+1,\"\"),$AS72)))","v":""},{"$f":"IF(ISERROR(INDEX(AK$71:AK$93,SMALL(IF(AK$71:AK$93<>\"\",ROW(AK$71:AK$93)-ROW(AK$71)+1,\"\"),$AS72))),\"\",INDEX(AK$71:AK$93,SMALL(IF(AK$71:AK$93<>\"\",ROW(AK$71:AK$93)-ROW(AK$71)+1,\"\"),$AS72)))","v":""},{"$f":"IF(ISERROR(INDEX(AL$71:AL$93,SMALL(IF(AL$71:AL$93<>\"\",ROW(AL$71:AL$93)-ROW(AL$71)+1,\"\"),$AS72))),\"\",INDEX(AL$71:AL$93,SMALL(IF(AL$71:AL$93<>\"\",ROW(AL$71:AL$93)-ROW(AL$71)+1,\"\"),$AS72)))","v":""},{"$f":"IF(ISERROR(INDEX(AM$71:AM$93,SMALL(IF(AM$71:AM$93<>\"\",ROW(AM$71:AM$93)-ROW(AM$71)+1,\"\"),$AS72))),\"\",INDEX(AM$71:AM$93,SMALL(IF(AM$71:AM$93<>\"\",ROW(AM$71:AM$93)-ROW(AM$71)+1,\"\"),$AS72)))","v":""},{"$f":"IF(ISERROR(INDEX(AN$71:AN$93,SMALL(IF(AN$71:AN$93<>\"\",ROW(AN$71:AN$93)-ROW(AN$71)+1,\"\"),$AS72))),\"\",INDEX(AN$71:AN$93,SMALL(IF(AN$71:AN$93<>\"\",ROW(AN$71:AN$93)-ROW(AN$71)+1,\"\"),$AS72)))","v":""},{"$f":"IF(ISERROR(INDEX(AO$71:AO$93,SMALL(IF(AO$71:AO$93<>\"\",ROW(AO$71:AO$93)-ROW(AO$71)+1,\"\"),$AS72))),\"\",INDEX(AO$71:AO$93,SMALL(IF(AO$71:AO$93<>\"\",ROW(AO$71:AO$93)-ROW(AO$71)+1,\"\"),$AS72)))","v":""},{"$f":"IF(ISERROR(INDEX(AP$71:AP$93,SMALL(IF(AP$71:AP$93<>\"\",ROW(AP$71:AP$93)-ROW(AP$71)+1,\"\"),$AS72))),\"\",INDEX(AP$71:AP$93,SMALL(IF(AP$71:AP$93<>\"\",ROW(AP$71:AP$93)-ROW(AP$71)+1,\"\"),$AS72)))","v":""},{"$f":"IF(ISERROR(INDEX(AQ$71:AQ$93,SMALL(IF(AQ$71:AQ$93<>\"\",ROW(AQ$71:AQ$93)-ROW(AQ$71)+1,\"\"),$AS72))),\"\",INDEX(AQ$71:AQ$93,SMALL(IF(AQ$71:AQ$93<>\"\",ROW(AQ$71:AQ$93)-ROW(AQ$71)+1,\"\"),$AS72)))","v":""}]
["Fighting","d4-2","d4-2","d4-2","d4-2","d4-2","d4-2","d4-2","d4-2","d4-2","d4-2","d4-2","d4-2",null,null,"Fighting",0,0,0,0,0,0,0,0,0,0,0,0,null,null,"Fighting","","","","","","","","","","","","",null,2,"Fighting",{"$f":"IF(ISERROR(INDEX(AF$71:AF$93,SMALL(IF(AF$71:AF$93<>\"\",ROW(AF$71:AF$93)-ROW(AF$71)+1,\"\"),$AS73))),\"\",INDEX(AF$71:AF$93,SMALL(IF(AF$71:AF$93<>\"\",ROW(AF$71:AF$93)-ROW(AF$71)+1,\"\"),$AS73)))","v":""},{"$f":"IF(ISERROR(INDEX(AG$71:AG$93,SMALL(IF(AG$71:AG$93<>\"\",ROW(AG$71:AG$93)-ROW(AG$71)+1,\"\"),$AS73))),\"\",INDEX(AG$71:AG$93,SMALL(IF(AG$71:AG$93<>\"\",ROW(AG$71:AG$93)-ROW(AG$71)+1,\"\"),$AS73)))","v":""},{"$f":"IF(ISERROR(INDEX(AH$71:AH$93,SMALL(IF(AH$71:AH$93<>\"\",ROW(AH$71:AH$93)-ROW(AH$71)+1,\"\"),$AS73))),\"\",INDEX(AH$71:AH$93,SMALL(IF(AH$71:AH$93<>\"\",ROW(AH$71:AH$93)-ROW(AH$71)+1,\"\"),$AS73)))","v":""},{"$f":"IF(ISERROR(INDEX(AI$71:AI$93,SMALL(IF(AI$71:AI$93<>\"\",ROW(AI$71:AI$93)-ROW(AI$71)+1,\"\"),$AS73))),\"\",INDEX(AI$71:AI$93,SMALL(IF(AI$71:AI$93<>\"\",ROW(AI$71:AI$93)-ROW(AI$71)+1,\"\"),$AS73)))","v":""},{"$f":"IF(ISERROR(INDEX(AJ$71:AJ$93,SMALL(IF(AJ$71:AJ$93<>\"\",ROW(AJ$71:AJ$93)-ROW(AJ$71)+1,\"\"),$AS73))),\"\",INDEX(AJ$71:AJ$93,SMALL(IF(AJ$71:AJ$93<>\"\",ROW(AJ$71:AJ$93)-ROW(AJ$71)+1,\"\"),$AS73)))","v":""},{"$f":"IF(ISERROR(INDEX(AK$71:AK$93,SMALL(IF(AK$71:AK$93<>\"\",ROW(AK$71:AK$93)-ROW(AK$71)+1,\"\"),$AS73))),\"\",INDEX(AK$71:AK$93,SMALL(IF(AK$71:AK$93<>\"\",ROW(AK$71:AK$93)-ROW(AK$71)+1,\"\"),$AS73)))","v":""},{"$f":"IF(ISERROR(INDEX(AL$71:AL$93,SMALL(IF(AL$71:AL$93<>\"\",ROW(AL$71:AL$93)-ROW(AL$71)+1,\"\"),$AS73))),\"\",INDEX(AL$71:AL$93,SMALL(IF(AL$71:AL$93<>\"\",ROW(AL$71:AL$93)-ROW(AL$71)+1,\"\"),$AS73)))","v":""},{"$f":"IF(ISERROR(INDEX(AM$71:AM$93,SMALL(IF(AM$71:AM$93<>\"\",ROW(AM$71:AM$93)-ROW(AM$71)+1,\"\"),$AS73))),\"\",INDEX(AM$71:AM$93,SMALL(IF(AM$71:AM$93<>\"\",ROW(AM$71:AM$93)-ROW(AM$71)+1,\"\"),$AS73)))","v":""},{"$f":"IF(ISERROR(INDEX(AN$71:AN$93,SMALL(IF(AN$71:AN$93<>\"\",ROW(AN$71:AN$93)-ROW(AN$71)+1,\"\"),$AS73))),\"\",INDEX(AN$71:AN$93,SMALL(IF(AN$71:AN$93<>\"\",ROW(AN$71:AN$93)-ROW(AN$71)+1,\"\"),$AS73)))","v":""},{"$f":"IF(ISERROR(INDEX(AO$71:AO$93,SMALL(IF(AO$71:AO$93<>\"\",ROW(AO$71:AO$93)-ROW(AO$71)+1,\"\"),$AS73))),\"\",INDEX(AO$71:AO$93,SMALL(IF(AO$71:AO$93<>\"\",ROW(AO$71:AO$93)-ROW(AO$71)+1,\"\"),$AS73)))","v":""},{"$f":"IF(ISERROR(INDEX(AP$71:AP$93,SMALL(IF(AP$71:AP$93<>\"\",ROW(AP$71:AP$93)-ROW(AP$71)+1,\"\"),$AS73))),\"\",INDEX(AP$71:AP$93,SMALL(IF(AP$71:AP$93<>\"\",ROW(AP$71:AP$93)-ROW(AP$71)+1,\"\"),$AS73)))","v":""},{"$f":"IF(ISERROR(INDEX(AQ$71:AQ$93,SMALL(IF(AQ$71:AQ$93<>\"\",ROW(AQ$71:AQ$93)-ROW(AQ$71)+1,\"\"),$AS73))),\"\",INDEX(AQ$71:AQ$93,SMALL(IF(AQ$71:AQ$93<>\"\",ROW(AQ$71:AQ$93)-ROW(AQ$71)+1,\"\"),$AS73)))","v":""}]
["Healing","d4-2","d4-2","d4-2","d4-2","d4-2","d4-2","d4-2","d4-2","d4-2","d4-2","d4-2","d4-2",null,null,"Healing",0,0,0,0,0,0,0,0,0,0,0,0,null,null,"Healing","","","","","","","","","","","","",null,3,"Healing",{"$f":"IF(ISERROR(INDEX(AF$71:AF$93,SMALL(IF(AF$71:AF$93<>\"\",ROW(AF$71:AF$93)-ROW(AF$71)+1,\"\"),$AS74))),\"\",INDEX(AF$71:AF$93,SMALL(IF(AF$71:AF$93<>\"\",ROW(AF$71:AF$93)-ROW(AF$71)+1,\"\"),$AS74)))","v":""},{"$f":"IF(ISERROR(INDEX(AG$71:AG$93,SMALL(IF(AG$71:AG$93<>\"\",ROW(AG$71:AG$93)-ROW(AG$71)+1,\"\"),$AS74))),\"\",INDEX(AG$71:AG$93,SMALL(IF(AG$71:AG$93<>\"\",ROW(AG$71:AG$93)-ROW(AG$71)+1,\"\"),$AS74)))","v":""},{"$f":"IF(ISERROR(INDEX(AH$71:AH$93,SMALL(IF(AH$71:AH$93<>\"\",ROW(AH$71:AH$93)-ROW(AH$71)+1,\"\"),$AS74))),\"\",INDEX(AH$71:AH$93,SMALL(IF(AH$71:AH$93<>\"\",ROW(AH$71:AH$93)-ROW(AH$71)+1,\"\"),$AS74)))","v":""},{"$f":"IF(ISERROR(INDEX(AI$71:AI$93,SMALL(IF(AI$71:AI$93<>\"\",ROW(AI$71:AI$93)-ROW(AI$71)+1,\"\"),$AS74))),\"\",INDEX(AI$71:AI$93,SMALL(IF(AI$71:AI$93<>\"\",ROW(AI$71:AI$93)-ROW(AI$71)+1,\"\"),$AS74)))","v":""},{"$f":"IF(ISERROR(INDEX(AJ$71:AJ$93,SMALL(IF(AJ$71:AJ$93<>\"\",ROW(AJ$71:AJ$93)-ROW(AJ$71)+1,\"\"),$AS74))),\"\",INDEX(AJ$71:AJ$93,SMALL(IF(AJ$71:AJ$93<>\"\",ROW(AJ$71:AJ$93)-ROW(AJ$71)+1,\"\"),$AS74)))","v":""},{"$f":"IF(ISERROR(INDEX(AK$71:AK$93,SMALL(IF(AK$71:AK$93<>\"\",ROW(AK$71:AK$93)-ROW(AK$71)+1,\"\"),$AS74))),\"\",INDEX(AK$71:AK$93,SMALL(IF(AK$71:AK$93<>\"\",ROW(AK$71:AK$93)-ROW(AK$71)+1,\"\"),$AS74)))","v":""},{"$f":"IF(ISERROR(INDEX(AL$71:AL$93,SMALL(IF(AL$71:AL$93<>\"\",ROW(AL$71:AL$93)-ROW(AL$71)+1,\"\"),$AS74))),\"\",INDEX(AL$71:AL$93,SMALL(IF(AL$71:AL$93<>\"\",ROW(AL$71:AL$93)-ROW(AL$71)+1,\"\"),$AS74)))","v":""},{"$f":"IF(ISERROR(INDEX(AM$71:AM$93,SMALL(IF(AM$71:AM$93<>\"\",ROW(AM$71:AM$93)-ROW(AM$71)+1,\"\"),$AS74))),\"\",INDEX(AM$71:AM$93,SMALL(IF(AM$71:AM$93<>\"\",ROW(AM$71:AM$93)-ROW(AM$71)+1,\"\"),$AS74)))","v":""},{"$f":"IF(ISERROR(INDEX(AN$71:AN$93,SMALL(IF(AN$71:AN$93<>\"\",ROW(AN$71:AN$93)-ROW(AN$71)+1,\"\"),$AS74))),\"\",INDEX(AN$71:AN$93,SMALL(IF(AN$71:AN$93<>\"\",ROW(AN$71:AN$93)-ROW(AN$71)+1,\"\"),$AS74)))","v":""},{"$f":"IF(ISERROR(INDEX(AO$71:AO$93,SMALL(IF(AO$71:AO$93<>\"\",ROW(AO$71:AO$93)-ROW(AO$71)+1,\"\"),$AS74))),\"\",INDEX(AO$71:AO$93,SMALL(IF(AO$71:AO$93<>\"\",ROW(AO$71:AO$93)-ROW(AO$71)+1,\"\"),$AS74)))","v":""},{"$f":"IF(ISERROR(INDEX(AP$71:AP$93,SMALL(IF(AP$71:AP$93<>\"\",ROW(AP$71:AP$93)-ROW(AP$71)+1,\"\"),$AS74))),\"\",INDEX(AP$71:AP$93,SMALL(IF(AP$71:AP$93<>\"\",ROW(AP$71:AP$93)-ROW(AP$71)+1,\"\"),$AS74)))","v":""},{"$f":"IF(ISERROR(INDEX(AQ$71:AQ$93,SMALL(IF(AQ$71:AQ$93<>\"\",ROW(AQ$71:AQ$93)-ROW(AQ$71)+1,\"\"),$AS74))),\"\",INDEX(AQ$71:AQ$93,SMALL(IF(AQ$71:AQ$93<>\"\",ROW(AQ$71:AQ$93)-ROW(AQ$71)+1,\"\"),$AS74)))","v":""}]
["Intimdation","d4-2","d4-2","d4-2","d4-2","d4-2","d4-2","d4-2","d4-2","d4-2","d4-2","d4-2","d4-2",null,null,"Intimdation",0,0,0,0,0,0,0,0,0,0,0,0,null,null,"Intimdation","","","","","","","","","","","","",null,4,"Intimdation",{"$f":"IF(ISERROR(INDEX(AF$71:AF$93,SMALL(IF(AF$71:AF$93<>\"\",ROW(AF$71:AF$93)-ROW(AF$71)+1,\"\"),$AS75))),\"\",INDEX(AF$71:AF$93,SMALL(IF(AF$71:AF$93<>\"\",ROW(AF$71:AF$93)-ROW(AF$71)+1,\"\"),$AS75)))","v":""},{"$f":"IF(ISERROR(INDEX(AG$71:AG$93,SMALL(IF(AG$71:AG$93<>\"\",ROW(AG$71:AG$93)-ROW(AG$71)+1,\"\"),$AS75))),\"\",INDEX(AG$71:AG$93,SMALL(IF(AG$71:AG$93<>\"\",ROW(AG$71:AG$93)-ROW(AG$71)+1,\"\"),$AS75)))","v":""},{"$f":"IF(ISERROR(INDEX(AH$71:AH$93,SMALL(IF(AH$71:AH$93<>\"\",ROW(AH$71:AH$93)-ROW(AH$71)+1,\"\"),$AS75))),\"\",INDEX(AH$71:AH$93,SMALL(IF(AH$71:AH$93<>\"\",ROW(AH$71:AH$93)-ROW(AH$71)+1,\"\"),$AS75)))","v":""},{"$f":"IF(ISERROR(INDEX(AI$71:AI$93,SMALL(IF(AI$71:AI$93<>\"\",ROW(AI$71:AI$93)-ROW(AI$71)+1,\"\"),$AS75))),\"\",INDEX(AI$71:AI$93,SMALL(IF(AI$71:AI$93<>\"\",ROW(AI$71:AI$93)-ROW(AI$71)+1,\"\"),$AS75)))","v":""},{"$f":"IF(ISERROR(INDEX(AJ$71:AJ$93,SMALL(IF(AJ$71:AJ$93<>\"\",ROW(AJ$71:AJ$93)-ROW(AJ$71)+1,\"\"),$AS75))),\"\",INDEX(AJ$71:AJ$93,SMALL(IF(AJ$71:AJ$93<>\"\",ROW(AJ$71:AJ$93)-ROW(AJ$71)+1,\"\"),$AS75)))","v":""},{"$f":"IF(ISERROR(INDEX(AK$71:AK$93,SMALL(IF(AK$71:AK$93<>\"\",ROW(AK$71:AK$93)-ROW(AK$71)+1,\"\"),$AS75))),\"\",INDEX(AK$71:AK$93,SMALL(IF(AK$71:AK$93<>\"\",ROW(AK$71:AK$93)-ROW(AK$71)+1,\"\"),$AS75)))","v":""},{"$f":"IF(ISERROR(INDEX(AL$71:AL$93,SMALL(IF(AL$71:AL$93<>\"\",ROW(AL$71:AL$93)-ROW(AL$71)+1,\"\"),$AS75))),\"\",INDEX(AL$71:AL$93,SMALL(IF(AL$71:AL$93<>\"\",ROW(AL$71:AL$93)-ROW(AL$71)+1,\"\"),$AS75)))","v":""},{"$f":"IF(ISERROR(INDEX(AM$71:AM$93,SMALL(IF(AM$71:AM$93<>\"\",ROW(AM$71:AM$93)-ROW(AM$71)+1,\"\"),$AS75))),\"\",INDEX(AM$71:AM$93,SMALL(IF(AM$71:AM$93<>\"\",ROW(AM$71:AM$93)-ROW(AM$71)+1,\"\"),$AS75)))","v":""},{"$f":"IF(ISERROR(INDEX(AN$71:AN$93,SMALL(IF(AN$71:AN$93<>\"\",ROW(AN$71:AN$93)-ROW(AN$71)+1,\"\"),$AS75))),\"\",INDEX(AN$71:AN$93,SMALL(IF(AN$71:AN$93<>\"\",ROW(AN$71:AN$93)-ROW(AN$71)+1,\"\"),$AS75)))","v":""},{"$f":"IF(ISERROR(INDEX(AO$71:AO$93,SMALL(IF(AO$71:AO$93<>\"\",ROW(AO$71:AO$93)-ROW(AO$71)+1,\"\"),$AS75))),\"\",INDEX(AO$71:AO$93,SMALL(IF(AO$71:AO$93<>\"\",ROW(AO$71:AO$93)-ROW(AO$71)+1,\"\"),$AS75)))","v":""},{"$f":"IF(ISERROR(INDEX(AP$71:AP$93,SMALL(IF(AP$71:AP$93<>\"\",ROW(AP$71:AP$93)-ROW(AP$71)+1,\"\"),$AS75))),\"\",INDEX(AP$71:AP$93,SMALL(IF(AP$71:AP$93<>\"\",ROW(AP$71:AP$93)-ROW(AP$71)+1,\"\"),$AS75)))","v":""},{"$f":"IF(ISERROR(INDEX(AQ$71:AQ$93,SMALL(IF(AQ$71:AQ$93<>\"\",ROW(AQ$71:AQ$93)-ROW(AQ$71)+1,\"\"),$AS75))),\"\",INDEX(AQ$71:AQ$93,SMALL(IF(AQ$71:AQ$93<>\"\",ROW(AQ$71:AQ$93)-ROW(AQ$71)+1,\"\"),$AS75)))","v":""}]
["Notice","d4-2","d4-2","d4-2","d4-2","d4-2","d4-2","d4-2","d4-2","d4-2","d4-2","d4-2","d4-2",null,null,"Notice",0,0,0,0,0,0,0,0,0,0,0,0,null,null,"Notice","","","","","","","","","","","","",null,5,"Notice",{"$f":"IF(ISERROR(INDEX(AF$71:AF$93,SMALL(IF(AF$71:AF$93<>\"\",ROW(AF$71:AF$93)-ROW(AF$71)+1,\"\"),$AS76))),\"\",INDEX(AF$71:AF$93,SMALL(IF(AF$71:AF$93<>\"\",ROW(AF$71:AF$93)-ROW(AF$71)+1,\"\"),$AS76)))","v":""},{"$f":"IF(ISERROR(INDEX(AG$71:AG$93,SMALL(IF(AG$71:AG$93<>\"\",ROW(AG$71:AG$93)-ROW(AG$71)+1,\"\"),$AS76))),\"\",INDEX(AG$71:AG$93,SMALL(IF(AG$71:AG$93<>\"\",ROW(AG$71:AG$93)-ROW(AG$71)+1,\"\"),$AS76)))","v":""},{"$f":"IF(ISERROR(INDEX(AH$71:AH$93,SMALL(IF(AH$71:AH$93<>\"\",ROW(AH$71:AH$93)-ROW(AH$71)+1,\"\"),$AS76))),\"\",INDEX(AH$71:AH$93,SMALL(IF(AH$71:AH$93<>\"\",ROW(AH$71:AH$93)-ROW(AH$71)+1,\"\"),$AS76)))","v":""},{"$f":"IF(ISERROR(INDEX(AI$71:AI$93,SMALL(IF(AI$71:AI$93<>\"\",ROW(AI$71:AI$93)-ROW(AI$71)+1,\"\"),$AS76))),\"\",INDEX(AI$71:AI$93,SMALL(IF(AI$71:AI$93<>\"\",ROW(AI$71:AI$93)-ROW(AI$71)+1,\"\"),$AS76)))","v":""},{"$f":"IF(ISERROR(INDEX(AJ$71:AJ$93,SMALL(IF(AJ$71:AJ$93<>\"\",ROW(AJ$71:AJ$93)-ROW(AJ$71)+1,\"\"),$AS76))),\"\",INDEX(AJ$71:AJ$93,SMALL(IF(AJ$71:AJ$93<>\"\",ROW(AJ$71:AJ$93)-ROW(AJ$71)+1,\"\"),$AS76)))","v":""},{"$f":"IF(ISERROR(INDEX(AK$71:AK$93,SMALL(IF(AK$71:AK$93<>\"\",ROW(AK$71:AK$93)-ROW(AK$71)+1,\"\"),$AS76))),\"\",INDEX(AK$71:AK$93,SMALL(IF(AK$71:AK$93<>\"\",ROW(AK$71:AK$93)-ROW(AK$71)+1,\"\"),$AS76)))","v":""},{"$f":"IF(ISERROR(INDEX(AL$71:AL$93,SMALL(IF(AL$71:AL$93<>\"\",ROW(AL$71:AL$93)-ROW(AL$71)+1,\"\"),$AS76))),\"\",INDEX(AL$71:AL$93,SMALL(IF(AL$71:AL$93<>\"\",ROW(AL$71:AL$93)-ROW(AL$71)+1,\"\"),$AS76)))","v":""},{"$f":"IF(ISERROR(INDEX(AM$71:AM$93,SMALL(IF(AM$71:AM$93<>\"\",ROW(AM$71:AM$93)-ROW(AM$71)+1,\"\"),$AS76))),\"\",INDEX(AM$71:AM$93,SMALL(IF(AM$71:AM$93<>\"\",ROW(AM$71:AM$93)-ROW(AM$71)+1,\"\"),$AS76)))","v":""},{"$f":"IF(ISERROR(INDEX(AN$71:AN$93,SMALL(IF(AN$71:AN$93<>\"\",ROW(AN$71:AN$93)-ROW(AN$71)+1,\"\"),$AS76))),\"\",INDEX(AN$71:AN$93,SMALL(IF(AN$71:AN$93<>\"\",ROW(AN$71:AN$93)-ROW(AN$71)+1,\"\"),$AS76)))","v":""},{"$f":"IF(ISERROR(INDEX(AO$71:AO$93,SMALL(IF(AO$71:AO$93<>\"\",ROW(AO$71:AO$93)-ROW(AO$71)+1,\"\"),$AS76))),\"\",INDEX(AO$71:AO$93,SMALL(IF(AO$71:AO$93<>\"\",ROW(AO$71:AO$93)-ROW(AO$71)+1,\"\"),$AS76)))","v":""},{"$f":"IF(ISERROR(INDEX(AP$71:AP$93,SMALL(IF(AP$71:AP$93<>\"\",ROW(AP$71:AP$93)-ROW(AP$71)+1,\"\"),$AS76))),\"\",INDEX(AP$71:AP$93,SMALL(IF(AP$71:AP$93<>\"\",ROW(AP$71:AP$93)-ROW(AP$71)+1,\"\"),$AS76)))","v":""},{"$f":"IF(ISERROR(INDEX(AQ$71:AQ$93,SMALL(IF(AQ$71:AQ$93<>\"\",ROW(AQ$71:AQ$93)-ROW(AQ$71)+1,\"\"),$AS76))),\"\",INDEX(AQ$71:AQ$93,SMALL(IF(AQ$71:AQ$93<>\"\",ROW(AQ$71:AQ$93)-ROW(AQ$71)+1,\"\"),$AS76)))","v":""}]
["Riding","d4-2","d4-2","d4-2","d4-2","d4-2","d4-2","d4-2","d4-2","d4-2","d4-2","d4-2","d4-2",null,null,"Riding",0,0,0,0,0,0,0,0,0,0,0,0,null,null,"Riding","","","","","","","","","","","","",null,6,"Riding",{"$f":"IF(ISERROR(INDEX(AF$71:AF$93,SMALL(IF(AF$71:AF$93<>\"\",ROW(AF$71:AF$93)-ROW(AF$71)+1,\"\"),$AS77))),\"\",INDEX(AF$71:AF$93,SMALL(IF(AF$71:AF$93<>\"\",ROW(AF$71:AF$93)-ROW(AF$71)+1,\"\"),$AS77)))","v":""},{"$f":"IF(ISERROR(INDEX(AG$71:AG$93,SMALL(IF(AG$71:AG$93<>\"\",ROW(AG$71:AG$93)-ROW(AG$71)+1,\"\"),$AS77))),\"\",INDEX(AG$71:AG$93,SMALL(IF(AG$71:AG$93<>\"\",ROW(AG$71:AG$93)-ROW(AG$71)+1,\"\"),$AS77)))","v":""},{"$f":"IF(ISERROR(INDEX(AH$71:AH$93,SMALL(IF(AH$71:AH$93<>\"\",ROW(AH$71:AH$93)-ROW(AH$71)+1,\"\"),$AS77))),\"\",INDEX(AH$71:AH$93,SMALL(IF(AH$71:AH$93<>\"\",ROW(AH$71:AH$93)-ROW(AH$71)+1,\"\"),$AS77)))","v":""},{"$f":"IF(ISERROR(INDEX(AI$71:AI$93,SMALL(IF(AI$71:AI$93<>\"\",ROW(AI$71:AI$93)-ROW(AI$71)+1,\"\"),$AS77))),\"\",INDEX(AI$71:AI$93,SMALL(IF(AI$71:AI$93<>\"\",ROW(AI$71:AI$93)-ROW(AI$71)+1,\"\"),$AS77)))","v":""},{"$f":"IF(ISERROR(INDEX(AJ$71:AJ$93,SMALL(IF(AJ$71:AJ$93<>\"\",ROW(AJ$71:AJ$93)-ROW(AJ$71)+1,\"\"),$AS77))),\"\",INDEX(AJ$71:AJ$93,SMALL(IF(AJ$71:AJ$93<>\"\",ROW(AJ$71:AJ$93)-ROW(AJ$71)+1,\"\"),$AS77)))","v":""},{"$f":"IF(ISERROR(INDEX(AK$71:AK$93,SMALL(IF(AK$71:AK$93<>\"\",ROW(AK$71:AK$93)-ROW(AK$71)+1,\"\"),$AS77))),\"\",INDEX(AK$71:AK$93,SMALL(IF(AK$71:AK$93<>\"\",ROW(AK$71:AK$93)-ROW(AK$71)+1,\"\"),$AS77)))","v":""},{"$f":"IF(ISERROR(INDEX(AL$71:AL$93,SMALL(IF(AL$71:AL$93<>\"\",ROW(AL$71:AL$93)-ROW(AL$71)+1,\"\"),$AS77))),\"\",INDEX(AL$71:AL$93,SMALL(IF(AL$71:AL$93<>\"\",ROW(AL$71:AL$93)-ROW(AL$71)+1,\"\"),$AS77)))","v":""},{"$f":"IF(ISERROR(INDEX(AM$71:AM$93,SMALL(IF(AM$71:AM$93<>\"\",ROW(AM$71:AM$93)-ROW(AM$71)+1,\"\"),$AS77))),\"\",INDEX(AM$71:AM$93,SMALL(IF(AM$71:AM$93<>\"\",ROW(AM$71:AM$93)-ROW(AM$71)+1,\"\"),$AS77)))","v":""},{"$f":"IF(ISERROR(INDEX(AN$71:AN$93,SMALL(IF(AN$71:AN$93<>\"\",ROW(AN$71:AN$93)-ROW(AN$71)+1,\"\"),$AS77))),\"\",INDEX(AN$71:AN$93,SMALL(IF(AN$71:AN$93<>\"\",ROW(AN$71:AN$93)-ROW(AN$71)+1,\"\"),$AS77)))","v":""},{"$f":"IF(ISERROR(INDEX(AO$71:AO$93,SMALL(IF(AO$71:AO$93<>\"\",ROW(AO$71:AO$93)-ROW(AO$71)+1,\"\"),$AS77))),\"\",INDEX(AO$71:AO$93,SMALL(IF(AO$71:AO$93<>\"\",ROW(AO$71:AO$93)-ROW(AO$71)+1,\"\"),$AS77)))","v":""},{"$f":"IF(ISERROR(INDEX(AP$71:AP$93,SMALL(IF(AP$71:AP$93<>\"\",ROW(AP$71:AP$93)-ROW(AP$71)+1,\"\"),$AS77))),\"\",INDEX(AP$71:AP$93,SMALL(IF(AP$71:AP$93<>\"\",ROW(AP$71:AP$93)-ROW(AP$71)+1,\"\"),$AS77)))","v":""},{"$f":"IF(ISERROR(INDEX(AQ$71:AQ$93,SMALL(IF(AQ$71:AQ$93<>\"\",ROW(AQ$71:AQ$93)-ROW(AQ$71)+1,\"\"),$AS77))),\"\",INDEX(AQ$71:AQ$93,SMALL(IF(AQ$71:AQ$93<>\"\",ROW(AQ$71:AQ$93)-ROW(AQ$71)+1,\"\"),$AS77)))","v":""}]
["Shooting","d4-2","d4-2","d4-2","d4-2","d4-2","d4-2","d4-2","d4-2","d4-2","d4-2","d4-2","d4-2",null,null,"Shooting",0,0,0,0,0,0,0,0,0,0,0,0,null,null,"Shooting","","","","","","","","","","","","",null,7,"Shooting",{"$f":"IF(ISERROR(INDEX(AF$71:AF$93,SMALL(IF(AF$71:AF$93<>\"\",ROW(AF$71:AF$93)-ROW(AF$71)+1,\"\"),$AS78))),\"\",INDEX(AF$71:AF$93,SMALL(IF(AF$71:AF$93<>\"\",ROW(AF$71:AF$93)-ROW(AF$71)+1,\"\"),$AS78)))","v":""},{"$f":"IF(ISERROR(INDEX(AG$71:AG$93,SMALL(IF(AG$71:AG$93<>\"\",ROW(AG$71:AG$93)-ROW(AG$71)+1,\"\"),$AS78))),\"\",INDEX(AG$71:AG$93,SMALL(IF(AG$71:AG$93<>\"\",ROW(AG$71:AG$93)-ROW(AG$71)+1,\"\"),$AS78)))","v":""},{"$f":"IF(ISERROR(INDEX(AH$71:AH$93,SMALL(IF(AH$71:AH$93<>\"\",ROW(AH$71:AH$93)-ROW(AH$71)+1,\"\"),$AS78))),\"\",INDEX(AH$71:AH$93,SMALL(IF(AH$71:AH$93<>\"\",ROW(AH$71:AH$93)-ROW(AH$71)+1,\"\"),$AS78)))","v":""},{"$f":"IF(ISERROR(INDEX(AI$71:AI$93,SMALL(IF(AI$71:AI$93<>\"\",ROW(AI$71:AI$93)-ROW(AI$71)+1,\"\"),$AS78))),\"\",INDEX(AI$71:AI$93,SMALL(IF(AI$71:AI$93<>\"\",ROW(AI$71:AI$93)-ROW(AI$71)+1,\"\"),$AS78)))","v":""},{"$f":"IF(ISERROR(INDEX(AJ$71:AJ$93,SMALL(IF(AJ$71:AJ$93<>\"\",ROW(AJ$71:AJ$93)-ROW(AJ$71)+1,\"\"),$AS78))),\"\",INDEX(AJ$71:AJ$93,SMALL(IF(AJ$71:AJ$93<>\"\",ROW(AJ$71:AJ$93)-ROW(AJ$71)+1,\"\"),$AS78)))","v":""},{"$f":"IF(ISERROR(INDEX(AK$71:AK$93,SMALL(IF(AK$71:AK$93<>\"\",ROW(AK$71:AK$93)-ROW(AK$71)+1,\"\"),$AS78))),\"\",INDEX(AK$71:AK$93,SMALL(IF(AK$71:AK$93<>\"\",ROW(AK$71:AK$93)-ROW(AK$71)+1,\"\"),$AS78)))","v":""},{"$f":"IF(ISERROR(INDEX(AL$71:AL$93,SMALL(IF(AL$71:AL$93<>\"\",ROW(AL$71:AL$93)-ROW(AL$71)+1,\"\"),$AS78))),\"\",INDEX(AL$71:AL$93,SMALL(IF(AL$71:AL$93<>\"\",ROW(AL$71:AL$93)-ROW(AL$71)+1,\"\"),$AS78)))","v":""},{"$f":"IF(ISERROR(INDEX(AM$71:AM$93,SMALL(IF(AM$71:AM$93<>\"\",ROW(AM$71:AM$93)-ROW(AM$71)+1,\"\"),$AS78))),\"\",INDEX(AM$71:AM$93,SMALL(IF(AM$71:AM$93<>\"\",ROW(AM$71:AM$93)-ROW(AM$71)+1,\"\"),$AS78)))","v":""},{"$f":"IF(ISERROR(INDEX(AN$71:AN$93,SMALL(IF(AN$71:AN$93<>\"\",ROW(AN$71:AN$93)-ROW(AN$71)+1,\"\"),$AS78))),\"\",INDEX(AN$71:AN$93,SMALL(IF(AN$71:AN$93<>\"\",ROW(AN$71:AN$93)-ROW(AN$71)+1,\"\"),$AS78)))","v":""},{"$f":"IF(ISERROR(INDEX(AO$71:AO$93,SMALL(IF(AO$71:AO$93<>\"\",ROW(AO$71:AO$93)-ROW(AO$71)+1,\"\"),$AS78))),\"\",INDEX(AO$71:AO$93,SMALL(IF(AO$71:AO$93<>\"\",ROW(AO$71:AO$93)-ROW(AO$71)+1,\"\"),$AS78)))","v":""},{"$f":"IF(ISERROR(INDEX(AP$71:AP$93,SMALL(IF(AP$71:AP$93<>\"\",ROW(AP$71:AP$93)-ROW(AP$71)+1,\"\"),$AS78))),\"\",INDEX(AP$71:AP$93,SMALL(IF(AP$71:AP$93<>\"\",ROW(AP$71:AP$93)-ROW(AP$71)+1,\"\"),$AS78)))","v":""},{"$f":"IF(ISERROR(INDEX(AQ$71:AQ$93,SMALL(IF(AQ$71:AQ$93<>\"\",ROW(AQ$71:AQ$93)-ROW(AQ$71)+1,\"\"),$AS78))),\"\",INDEX(AQ$71:AQ$93,SMALL(IF(AQ$71:AQ$93<>\"\",ROW(AQ$71:AQ$93)-ROW(AQ$71)+1,\"\"),$AS78)))","v":""}]
["Stealth","d4-2","d4-2","d4-2","d4-2","d4-2","d4-2","d4-2","d4-2","d4-2","d4-2","d4-2","d4-2",null,null,"Stealth",0,0,0,0,0,0,0,0,0,0,0,0,null,null,"Stealth","","","","","","","","","","","","",null,8,"Stealth",{"$f":"IF(ISERROR(INDEX(AF$71:AF$93,SMALL(IF(AF$71:AF$93<>\"\",ROW(AF$71:AF$93)-ROW(AF$71)+1,\"\"),$AS79))),\"\",INDEX(AF$71:AF$93,SMALL(IF(AF$71:AF$93<>\"\",ROW(AF$71:AF$93)-ROW(AF$71)+1,\"\"),$AS79)))","v":""},{"$f":"IF(ISERROR(INDEX(AG$71:AG$93,SMALL(IF(AG$71:AG$93<>\"\",ROW(AG$71:AG$93)-ROW(AG$71)+1,\"\"),$AS79))),\"\",INDEX(AG$71:AG$93,SMALL(IF(AG$71:AG$93<>\"\",ROW(AG$71:AG$93)-ROW(AG$71)+1,\"\"),$AS79)))","v":""},{"$f":"IF(ISERROR(INDEX(AH$71:AH$93,SMALL(IF(AH$71:AH$93<>\"\",ROW(AH$71:AH$93)-ROW(AH$71)+1,\"\"),$AS79))),\"\",INDEX(AH$71:AH$93,SMALL(IF(AH$71:AH$93<>\"\",ROW(AH$71:AH$93)-ROW(AH$71)+1,\"\"),$AS79)))","v":""},{"$f":"IF(ISERROR(INDEX(AI$71:AI$93,SMALL(IF(AI$71:AI$93<>\"\",ROW(AI$71:AI$93)-ROW(AI$71)+1,\"\"),$AS79))),\"\",INDEX(AI$71:AI$93,SMALL(IF(AI$71:AI$93<>\"\",ROW(AI$71:AI$93)-ROW(AI$71)+1,\"\"),$AS79)))","v":""},{"$f":"IF(ISERROR(INDEX(AJ$71:AJ$93,SMALL(IF(AJ$71:AJ$93<>\"\",ROW(AJ$71:AJ$93)-ROW(AJ$71)+1,\"\"),$AS79))),\"\",INDEX(AJ$71:AJ$93,SMALL(IF(AJ$71:AJ$93<>\"\",ROW(AJ$71:AJ$93)-ROW(AJ$71)+1,\"\"),$AS79)))","v":""},{"$f":"IF(ISERROR(INDEX(AK$71:AK$93,SMALL(IF(AK$71:AK$93<>\"\",ROW(AK$71:AK$93)-ROW(AK$71)+1,\"\"),$AS79))),\"\",INDEX(AK$71:AK$93,SMALL(IF(AK$71:AK$93<>\"\",ROW(AK$71:AK$93)-ROW(AK$71)+1,\"\"),$AS79)))","v":""},{"$f":"IF(ISERROR(INDEX(AL$71:AL$93,SMALL(IF(AL$71:AL$93<>\"\",ROW(AL$71:AL$93)-ROW(AL$71)+1,\"\"),$AS79))),\"\",INDEX(AL$71:AL$93,SMALL(IF(AL$71:AL$93<>\"\",ROW(AL$71:AL$93)-ROW(AL$71)+1,\"\"),$AS79)))","v":""},{"$f":"IF(ISERROR(INDEX(AM$71:AM$93,SMALL(IF(AM$71:AM$93<>\"\",ROW(AM$71:AM$93)-ROW(AM$71)+1,\"\"),$AS79))),\"\",INDEX(AM$71:AM$93,SMALL(IF(AM$71:AM$93<>\"\",ROW(AM$71:AM$93)-ROW(AM$71)+1,\"\"),$AS79)))","v":""},{"$f":"IF(ISERROR(INDEX(AN$71:AN$93,SMALL(IF(AN$71:AN$93<>\"\",ROW(AN$71:AN$93)-ROW(AN$71)+1,\"\"),$AS79))),\"\",INDEX(AN$71:AN$93,SMALL(IF(AN$71:AN$93<>\"\",ROW(AN$71:AN$93)-ROW(AN$71)+1,\"\"),$AS79)))","v":""},{"$f":"IF(ISERROR(INDEX(AO$71:AO$93,SMALL(IF(AO$71:AO$93<>\"\",ROW(AO$71:AO$93)-ROW(AO$71)+1,\"\"),$AS79))),\"\",INDEX(AO$71:AO$93,SMALL(IF(AO$71:AO$93<>\"\",ROW(AO$71:AO$93)-ROW(AO$71)+1,\"\"),$AS79)))","v":""},{"$f":"IF(ISERROR(INDEX(AP$71:AP$93,SMALL(IF(AP$71:AP$93<>\"\",ROW(AP$71:AP$93)-ROW(AP$71)+1,\"\"),$AS79))),\"\",INDEX(AP$71:AP$93,SMALL(IF(AP$71:AP$93<>\"\",ROW(AP$71:AP$93)-ROW(AP$71)+1,\"\"),$AS79)))","v":""},{"$f":"IF(ISERROR(INDEX(AQ$71:AQ$93,SMALL(IF(AQ$71:AQ$93<>\"\",ROW(AQ$71:AQ$93)-ROW(AQ$71)+1,\"\"),$AS79))),\"\",INDEX(AQ$71:AQ$93,SMALL(IF(AQ$71:AQ$93<>\"\",ROW(AQ$71:AQ$93)-ROW(AQ$71)+1,\"\"),$AS79)))","v":""}]
["Taunt","d4-2","d4-2","d4-2","d4-2","d4-2","d4-2","d4-2","d4-2","d4-2","d4-2","d4-2","d4-2",null,null,"Taunt",0,0,0,0,0,0,0,0,0,0,0,0,null,null,"Taunt","","","","","","","","","","","","",null,9,"Taunt",{"$f":"IF(ISERROR(INDEX(AF$71:AF$93,SMALL(IF(AF$71:AF$93<>\"\",ROW(AF$71:AF$93)-ROW(AF$71)+1,\"\"),$AS80))),\"\",INDEX(AF$71:AF$93,SMALL(IF(AF$71:AF$93<>\"\",ROW(AF$71:AF$93)-ROW(AF$71)+1,\"\"),$AS80)))","v":""},{"$f":"IF(ISERROR(INDEX(AG$71:AG$93,SMALL(IF(AG$71:AG$93<>\"\",ROW(AG$71:AG$93)-ROW(AG$71)+1,\"\"),$AS80))),\"\",INDEX(AG$71:AG$93,SMALL(IF(AG$71:AG$93<>\"\",ROW(AG$71:AG$93)-ROW(AG$71)+1,\"\"),$AS80)))","v":""},{"$f":"IF(ISERROR(INDEX(AH$71:AH$93,SMALL(IF(AH$71:AH$93<>\"\",ROW(AH$71:AH$93)-ROW(AH$71)+1,\"\"),$AS80))),\"\",INDEX(AH$71:AH$93,SMALL(IF(AH$71:AH$93<>\"\",ROW(AH$71:AH$93)-ROW(AH$71)+1,\"\"),$AS80)))","v":""},{"$f":"IF(ISERROR(INDEX(AI$71:AI$93,SMALL(IF(AI$71:AI$93<>\"\",ROW(AI$71:AI$93)-ROW(AI$71)+1,\"\"),$AS80))),\"\",INDEX(AI$71:AI$93,SMALL(IF(AI$71:AI$93<>\"\",ROW(AI$71:AI$93)-ROW(AI$71)+1,\"\"),$AS80)))","v":""},{"$f":"IF(ISERROR(INDEX(AJ$71:AJ$93,SMALL(IF(AJ$71:AJ$93<>\"\",ROW(AJ$71:AJ$93)-ROW(AJ$71)+1,\"\"),$AS80))),\"\",INDEX(AJ$71:AJ$93,SMALL(IF(AJ$71:AJ$93<>\"\",ROW(AJ$71:AJ$93)-ROW(AJ$71)+1,\"\"),$AS80)))","v":""},{"$f":"IF(ISERROR(INDEX(AK$71:AK$93,SMALL(IF(AK$71:AK$93<>\"\",ROW(AK$71:AK$93)-ROW(AK$71)+1,\"\"),$AS80))),\"\",INDEX(AK$71:AK$93,SMALL(IF(AK$71:AK$93<>\"\",ROW(AK$71:AK$93)-ROW(AK$71)+1,\"\"),$AS80)))","v":""},{"$f":"IF(ISERROR(INDEX(AL$71:AL$93,SMALL(IF(AL$71:AL$93<>\"\",ROW(AL$71:AL$93)-ROW(AL$71)+1,\"\"),$AS80))),\"\",INDEX(AL$71:AL$93,SMALL(IF(AL$71:AL$93<>\"\",ROW(AL$71:AL$93)-ROW(AL$71)+1,\"\"),$AS80)))","v":""},{"$f":"IF(ISERROR(INDEX(AM$71:AM$93,SMALL(IF(AM$71:AM$93<>\"\",ROW(AM$71:AM$93)-ROW(AM$71)+1,\"\"),$AS80))),\"\",INDEX(AM$71:AM$93,SMALL(IF(AM$71:AM$93<>\"\",ROW(AM$71:AM$93)-ROW(AM$71)+1,\"\"),$AS80)))","v":""},{"$f":"IF(ISERROR(INDEX(AN$71:AN$93,SMALL(IF(AN$71:AN$93<>\"\",ROW(AN$71:AN$93)-ROW(AN$71)+1,\"\"),$AS80))),\"\",INDEX(AN$71:AN$93,SMALL(IF(AN$71:AN$93<>\"\",ROW(AN$71:AN$93)-ROW(AN$71)+1,\"\"),$AS80)))","v":""},{"$f":"IF(ISERROR(INDEX(AO$71:AO$93,SMALL(IF(AO$71:AO$93<>\"\",ROW(AO$71:AO$93)-ROW(AO$71)+1,\"\"),$AS80))),\"\",INDEX(AO$71:AO$93,SMALL(IF(AO$71:AO$93<>\"\",ROW(AO$71:AO$93)-ROW(AO$71)+1,\"\"),$AS80)))","v":""},{"$f":"IF(ISERROR(INDEX(AP$71:AP$93,SMALL(IF(AP$71:AP$93<>\"\",ROW(AP$71:AP$93)-ROW(AP$71)+1,\"\"),$AS80))),\"\",INDEX(AP$71:AP$93,SMALL(IF(AP$71:AP$93<>\"\",ROW(AP$71:AP$93)-ROW(AP$71)+1,\"\"),$AS80)))","v":""},{"$f":"IF(ISERROR(INDEX(AQ$71:AQ$93,SMALL(IF(AQ$71:AQ$93<>\"\",ROW(AQ$71:AQ$93)-ROW(AQ$71)+1,\"\"),$AS80))),\"\",INDEX(AQ$71:AQ$93,SMALL(IF(AQ$71:AQ$93<>\"\",ROW(AQ$71:AQ$93)-ROW(AQ$71)+1,\"\"),$AS80)))","v":""}]
["Throwing","d4-2","d4-2","d4-2","d4-2","d4-2","d4-2","d4-2","d4-2","d4-2","d4-2","d4-2","d4-2",null,null,"Throwing",0,0,0,0,0,0,0,0,0,0,0,0,null,null,"Throwing","","","","","","","","","","","","",null,10,"Throwing",{"$f":"IF(ISERROR(INDEX(AF$71:AF$93,SMALL(IF(AF$71:AF$93<>\"\",ROW(AF$71:AF$93)-ROW(AF$71)+1,\"\"),$AS81))),\"\",INDEX(AF$71:AF$93,SMALL(IF(AF$71:AF$93<>\"\",ROW(AF$71:AF$93)-ROW(AF$71)+1,\"\"),$AS81)))","v":""},{"$f":"IF(ISERROR(INDEX(AG$71:AG$93,SMALL(IF(AG$71:AG$93<>\"\",ROW(AG$71:AG$93)-ROW(AG$71)+1,\"\"),$AS81))),\"\",INDEX(AG$71:AG$93,SMALL(IF(AG$71:AG$93<>\"\",ROW(AG$71:AG$93)-ROW(AG$71)+1,\"\"),$AS81)))","v":""},{"$f":"IF(ISERROR(INDEX(AH$71:AH$93,SMALL(IF(AH$71:AH$93<>\"\",ROW(AH$71:AH$93)-ROW(AH$71)+1,\"\"),$AS81))),\"\",INDEX(AH$71:AH$93,SMALL(IF(AH$71:AH$93<>\"\",ROW(AH$71:AH$93)-ROW(AH$71)+1,\"\"),$AS81)))","v":""},{"$f":"IF(ISERROR(INDEX(AI$71:AI$93,SMALL(IF(AI$71:AI$93<>\"\",ROW(AI$71:AI$93)-ROW(AI$71)+1,\"\"),$AS81))),\"\",INDEX(AI$71:AI$93,SMALL(IF(AI$71:AI$93<>\"\",ROW(AI$71:AI$93)-ROW(AI$71)+1,\"\"),$AS81)))","v":""},{"$f":"IF(ISERROR(INDEX(AJ$71:AJ$93,SMALL(IF(AJ$71:AJ$93<>\"\",ROW(AJ$71:AJ$93)-ROW(AJ$71)+1,\"\"),$AS81))),\"\",INDEX(AJ$71:AJ$93,SMALL(IF(AJ$71:AJ$93<>\"\",ROW(AJ$71:AJ$93)-ROW(AJ$71)+1,\"\"),$AS81)))","v":""},{"$f":"IF(ISERROR(INDEX(AK$71:AK$93,SMALL(IF(AK$71:AK$93<>\"\",ROW(AK$71:AK$93)-ROW(AK$71)+1,\"\"),$AS81))),\"\",INDEX(AK$71:AK$93,SMALL(IF(AK$71:AK$93<>\"\",ROW(AK$71:AK$93)-ROW(AK$71)+1,\"\"),$AS81)))","v":""},{"$f":"IF(ISERROR(INDEX(AL$71:AL$93,SMALL(IF(AL$71:AL$93<>\"\",ROW(AL$71:AL$93)-ROW(AL$71)+1,\"\"),$AS81))),\"\",INDEX(AL$71:AL$93,SMALL(IF(AL$71:AL$93<>\"\",ROW(AL$71:AL$93)-ROW(AL$71)+1,\"\"),$AS81)))","v":""},{"$f":"IF(ISERROR(INDEX(AM$71:AM$93,SMALL(IF(AM$71:AM$93<>\"\",ROW(AM$71:AM$93)-ROW(AM$71)+1,\"\"),$AS81))),\"\",INDEX(AM$71:AM$93,SMALL(IF(AM$71:AM$93<>\"\",ROW(AM$71:AM$93)-ROW(AM$71)+1,\"\"),$AS81)))","v":""},{"$f":"IF(ISERROR(INDEX(AN$71:AN$93,SMALL(IF(AN$71:AN$93<>\"\",ROW(AN$71:AN$93)-ROW(AN$71)+1,\"\"),$AS81))),\"\",INDEX(AN$71:AN$93,SMALL(IF(AN$71:AN$93<>\"\",ROW(AN$71:AN$93)-ROW(AN$71)+1,\"\"),$AS81)))","v":""},{"$f":"IF(ISERROR(INDEX(AO$71:AO$93,SMALL(IF(AO$71:AO$93<>\"\",ROW(AO$71:AO$93)-ROW(AO$71)+1,\"\"),$AS81))),\"\",INDEX(AO$71:AO$93,SMALL(IF(AO$71:AO$93<>\"\",ROW(AO$71:AO$93)-ROW(AO$71)+1,\"\"),$AS81)))","v":""},{"$f":"IF(ISERROR(INDEX(AP$71:AP$93,SMALL(IF(AP$71:AP$93<>\"\",ROW(AP$71:AP$93)-ROW(AP$71)+1,\"\"),$AS81))),\"\",INDEX(AP$71:AP$93,SMALL(IF(AP$71:AP$93<>\"\",ROW(AP$71:AP$93)-ROW(AP$71)+1,\"\"),$AS81)))","v":""},{"$f":"IF(ISERROR(INDEX(AQ$71:AQ$93,SMALL(IF(AQ$71:AQ$93<>\"\",ROW(AQ$71:AQ$93)-ROW(AQ$71)+1,\"\"),$AS81))),\"\",INDEX(AQ$71:AQ$93,SMALL(IF(AQ$71:AQ$93<>\"\",ROW(AQ$71:AQ$93)-ROW(AQ$71)+1,\"\"),$AS81)))","v":""}]
["Boating",{"$f":"IF(OR(ISERROR(VLOOKUP($A82,RS_Roster,MATCH(B$51,RS_Roster_Position,0),FALSE)),VLOOKUP($A82,RS_Roster,MATCH(B$51,RS_Roster_Position,0),FALSE)=\"\"),\"d4-2\",VLOOKUP($A82,RS_Roster,MATCH(B$51,RS_Roster_Position,0),FALSE))","v":"d4-2"},"d4-2","d4-2","d4-2","d4-2","d4-2","d4-2","d4-2","d4-2","d4-2","d4-2","d4-2",null,null,"Boating",{"$f":"IF(OR(ISERROR(VLOOKUP($A82,RS_Roster,MATCH(Q$51,RS_Roster_Position,0)+1,FALSE)),VLOOKUP($A82,RS_Roster,MATCH(Q$51,RS_Roster_Position,0)+1,FALSE)=\"\"),0,VLOOKUP($A82,RS_Roster,MATCH(Q$51,RS_Roster_Position,0)+1,FALSE))","v":0},0,0,0,0,0,0,0,0,0,0,0,null,null,"Boating","","","","","","","","","","","","",null,11,"Boating",{"$f":"IF(ISERROR(INDEX(AF$71:AF$93,SMALL(IF(AF$71:AF$93<>\"\",ROW(AF$71:AF$93)-ROW(AF$71)+1,\"\"),$AS82))),\"\",INDEX(AF$71:AF$93,SMALL(IF(AF$71:AF$93<>\"\",ROW(AF$71:AF$93)-ROW(AF$71)+1,\"\"),$AS82)))","v":""},{"$f":"IF(ISERROR(INDEX(AG$71:AG$93,SMALL(IF(AG$71:AG$93<>\"\",ROW(AG$71:AG$93)-ROW(AG$71)+1,\"\"),$AS82))),\"\",INDEX(AG$71:AG$93,SMALL(IF(AG$71:AG$93<>\"\",ROW(AG$71:AG$93)-ROW(AG$71)+1,\"\"),$AS82)))","v":""},{"$f":"IF(ISERROR(INDEX(AH$71:AH$93,SMALL(IF(AH$71:AH$93<>\"\",ROW(AH$71:AH$93)-ROW(AH$71)+1,\"\"),$AS82))),\"\",INDEX(AH$71:AH$93,SMALL(IF(AH$71:AH$93<>\"\",ROW(AH$71:AH$93)-ROW(AH$71)+1,\"\"),$AS82)))","v":""},{"$f":"IF(ISERROR(INDEX(AI$71:AI$93,SMALL(IF(AI$71:AI$93<>\"\",ROW(AI$71:AI$93)-ROW(AI$71)+1,\"\"),$AS82))),\"\",INDEX(AI$71:AI$93,SMALL(IF(AI$71:AI$93<>\"\",ROW(AI$71:AI$93)-ROW(AI$71)+1,\"\"),$AS82)))","v":""},{"$f":"IF(ISERROR(INDEX(AJ$71:AJ$93,SMALL(IF(AJ$71:AJ$93<>\"\",ROW(AJ$71:AJ$93)-ROW(AJ$71)+1,\"\"),$AS82))),\"\",INDEX(AJ$71:AJ$93,SMALL(IF(AJ$71:AJ$93<>\"\",ROW(AJ$71:AJ$93)-ROW(AJ$71)+1,\"\"),$AS82)))","v":""},{"$f":"IF(ISERROR(INDEX(AK$71:AK$93,SMALL(IF(AK$71:AK$93<>\"\",ROW(AK$71:AK$93)-ROW(AK$71)+1,\"\"),$AS82))),\"\",INDEX(AK$71:AK$93,SMALL(IF(AK$71:AK$93<>\"\",ROW(AK$71:AK$93)-ROW(AK$71)+1,\"\"),$AS82)))","v":""},{"$f":"IF(ISERROR(INDEX(AL$71:AL$93,SMALL(IF(AL$71:AL$93<>\"\",ROW(AL$71:AL$93)-ROW(AL$71)+1,\"\"),$AS82))),\"\",INDEX(AL$71:AL$93,SMALL(IF(AL$71:AL$93<>\"\",ROW(AL$71:AL$93)-ROW(AL$71)+1,\"\"),$AS82)))","v":""},{"$f":"IF(ISERROR(INDEX(AM$71:AM$93,SMALL(IF(AM$71:AM$93<>\"\",ROW(AM$71:AM$93)-ROW(AM$71)+1,\"\"),$AS82))),\"\",INDEX(AM$71:AM$93,SMALL(IF(AM$71:AM$93<>\"\",ROW(AM$71:AM$93)-ROW(AM$71)+1,\"\"),$AS82)))","v":""},{"$f":"IF(ISERROR(INDEX(AN$71:AN$93,SMALL(IF(AN$71:AN$93<>\"\",ROW(AN$71:AN$93)-ROW(AN$71)+1,\"\"),$AS82))),\"\",INDEX(AN$71:AN$93,SMALL(IF(AN$71:AN$93<>\"\",ROW(AN$71:AN$93)-ROW(AN$71)+1,\"\"),$AS82)))","v":""},{"$f":"IF(ISERROR(INDEX(AO$71:AO$93,SMALL(IF(AO$71:AO$93<>\"\",ROW(AO$71:AO$93)-ROW(AO$71)+1,\"\"),$AS82))),\"\",INDEX(AO$71:AO$93,SMALL(IF(AO$71:AO$93<>\"\",ROW(AO$71:AO$93)-ROW(AO$71)+1,\"\"),$AS82)))","v":""},{"$f":"IF(ISERROR(INDEX(AP$71:AP$93,SMALL(IF(AP$71:AP$93<>\"\",ROW(AP$71:AP$93)-ROW(AP$71)+1,\"\"),$AS82))),\"\",INDEX(AP$71:AP$93,SMALL(IF(AP$71:AP$93<>\"\",ROW(AP$71:AP$93)-ROW(AP$71)+1,\"\"),$AS82)))","v":""},{"$f":"IF(ISERROR(INDEX(AQ$71:AQ$93,SMALL(IF(AQ$71:AQ$93<>\"\",ROW(AQ$71:AQ$93)-ROW(AQ$71)+1,\"\"),$AS82))),\"\",INDEX(AQ$71:AQ$93,SMALL(IF(AQ$71:AQ$93<>\"\",ROW(AQ$71:AQ$93)-ROW(AQ$71)+1,\"\"),$AS82)))","v":""}]
["Climbing","d4-2","d4-2","d4-2","d4-2","d4-2","d4-2","d4-2","d4-2","d4-2","d4-2","d4-2","d4-2",null,null,"Climbing",0,0,0,0,0,0,0,0,0,0,0,0,null,null,"Climbing","","","","","","","","","","","","",null,12,"Climbing",{"$f":"IF(ISERROR(INDEX(AF$71:AF$93,SMALL(IF(AF$71:AF$93<>\"\",ROW(AF$71:AF$93)-ROW(AF$71)+1,\"\"),$AS83))),\"\",INDEX(AF$71:AF$93,SMALL(IF(AF$71:AF$93<>\"\",ROW(AF$71:AF$93)-ROW(AF$71)+1,\"\"),$AS83)))","v":""},{"$f":"IF(ISERROR(INDEX(AG$71:AG$93,SMALL(IF(AG$71:AG$93<>\"\",ROW(AG$71:AG$93)-ROW(AG$71)+1,\"\"),$AS83))),\"\",INDEX(AG$71:AG$93,SMALL(IF(AG$71:AG$93<>\"\",ROW(AG$71:AG$93)-ROW(AG$71)+1,\"\"),$AS83)))","v":""},{"$f":"IF(ISERROR(INDEX(AH$71:AH$93,SMALL(IF(AH$71:AH$93<>\"\",ROW(AH$71:AH$93)-ROW(AH$71)+1,\"\"),$AS83))),\"\",INDEX(AH$71:AH$93,SMALL(IF(AH$71:AH$93<>\"\",ROW(AH$71:AH$93)-ROW(AH$71)+1,\"\"),$AS83)))","v":""},{"$f":"IF(ISERROR(INDEX(AI$71:AI$93,SMALL(IF(AI$71:AI$93<>\"\",ROW(AI$71:AI$93)-ROW(AI$71)+1,\"\"),$AS83))),\"\",INDEX(AI$71:AI$93,SMALL(IF(AI$71:AI$93<>\"\",ROW(AI$71:AI$93)-ROW(AI$71)+1,\"\"),$AS83)))","v":""},{"$f":"IF(ISERROR(INDEX(AJ$71:AJ$93,SMALL(IF(AJ$71:AJ$93<>\"\",ROW(AJ$71:AJ$93)-ROW(AJ$71)+1,\"\"),$AS83))),\"\",INDEX(AJ$71:AJ$93,SMALL(IF(AJ$71:AJ$93<>\"\",ROW(AJ$71:AJ$93)-ROW(AJ$71)+1,\"\"),$AS83)))","v":""},{"$f":"IF(ISERROR(INDEX(AK$71:AK$93,SMALL(IF(AK$71:AK$93<>\"\",ROW(AK$71:AK$93)-ROW(AK$71)+1,\"\"),$AS83))),\"\",INDEX(AK$71:AK$93,SMALL(IF(AK$71:AK$93<>\"\",ROW(AK$71:AK$93)-ROW(AK$71)+1,\"\"),$AS83)))","v":""},{"$f":"IF(ISERROR(INDEX(AL$71:AL$93,SMALL(IF(AL$71:AL$93<>\"\",ROW(AL$71:AL$93)-ROW(AL$71)+1,\"\"),$AS83))),\"\",INDEX(AL$71:AL$93,SMALL(IF(AL$71:AL$93<>\"\",ROW(AL$71:AL$93)-ROW(AL$71)+1,\"\"),$AS83)))","v":""},{"$f":"IF(ISERROR(INDEX(AM$71:AM$93,SMALL(IF(AM$71:AM$93<>\"\",ROW(AM$71:AM$93)-ROW(AM$71)+1,\"\"),$AS83))),\"\",INDEX(AM$71:AM$93,SMALL(IF(AM$71:AM$93<>\"\",ROW(AM$71:AM$93)-ROW(AM$71)+1,\"\"),$AS83)))","v":""},{"$f":"IF(ISERROR(INDEX(AN$71:AN$93,SMALL(IF(AN$71:AN$93<>\"\",ROW(AN$71:AN$93)-ROW(AN$71)+1,\"\"),$AS83))),\"\",INDEX(AN$71:AN$93,SMALL(IF(AN$71:AN$93<>\"\",ROW(AN$71:AN$93)-ROW(AN$71)+1,\"\"),$AS83)))","v":""},{"$f":"IF(ISERROR(INDEX(AO$71:AO$93,SMALL(IF(AO$71:AO$93<>\"\",ROW(AO$71:AO$93)-ROW(AO$71)+1,\"\"),$AS83))),\"\",INDEX(AO$71:AO$93,SMALL(IF(AO$71:AO$93<>\"\",ROW(AO$71:AO$93)-ROW(AO$71)+1,\"\"),$AS83)))","v":""},{"$f":"IF(ISERROR(INDEX(AP$71:AP$93,SMALL(IF(AP$71:AP$93<>\"\",ROW(AP$71:AP$93)-ROW(AP$71)+1,\"\"),$AS83))),\"\",INDEX(AP$71:AP$93,SMALL(IF(AP$71:AP$93<>\"\",ROW(AP$71:AP$93)-ROW(AP$71)+1,\"\"),$AS83)))","v":""},{"$f":"IF(ISERROR(INDEX(AQ$71:AQ$93,SMALL(IF(AQ$71:AQ$93<>\"\",ROW(AQ$71:AQ$93)-ROW(AQ$71)+1,\"\"),$AS83))),\"\",INDEX(AQ$71:AQ$93,SMALL(IF(AQ$71:AQ$93<>\"\",ROW(AQ$71:AQ$93)-ROW(AQ$71)+1,\"\"),$AS83)))","v":""}]
["Gambling","d4-2","d4-2","d4-2","d4-2","d4-2","d4-2","d4-2","d4-2","d4-2","d4-2","d4-2","d4-2",null,null,"Gambling",0,0,0,0,0,0,0,0,0,0,0,0,null,null,"Gambling","","","","","","","","","","","","",null,13,"Gambling",{"$f":"IF(ISERROR(INDEX(AF$71:AF$93,SMALL(IF(AF$71:AF$93<>\"\",ROW(AF$71:AF$93)-ROW(AF$71)+1,\"\"),$AS84))),\"\",INDEX(AF$71:AF$93,SMALL(IF(AF$71:AF$93<>\"\",ROW(AF$71:AF$93)-ROW(AF$71)+1,\"\"),$AS84)))","v":""},{"$f":"IF(ISERROR(INDEX(AG$71:AG$93,SMALL(IF(AG$71:AG$93<>\"\",ROW(AG$71:AG$93)-ROW(AG$71)+1,\"\"),$AS84))),\"\",INDEX(AG$71:AG$93,SMALL(IF(AG$71:AG$93<>\"\",ROW(AG$71:AG$93)-ROW(AG$71)+1,\"\"),$AS84)))","v":""},{"$f":"IF(ISERROR(INDEX(AH$71:AH$93,SMALL(IF(AH$71:AH$93<>\"\",ROW(AH$71:AH$93)-ROW(AH$71)+1,\"\"),$AS84))),\"\",INDEX(AH$71:AH$93,SMALL(IF(AH$71:AH$93<>\"\",ROW(AH$71:AH$93)-ROW(AH$71)+1,\"\"),$AS84)))","v":""},{"$f":"IF(ISERROR(INDEX(AI$71:AI$93,SMALL(IF(AI$71:AI$93<>\"\",ROW(AI$71:AI$93)-ROW(AI$71)+1,\"\"),$AS84))),\"\",INDEX(AI$71:AI$93,SMALL(IF(AI$71:AI$93<>\"\",ROW(AI$71:AI$93)-ROW(AI$71)+1,\"\"),$AS84)))","v":""},{"$f":"IF(ISERROR(INDEX(AJ$71:AJ$93,SMALL(IF(AJ$71:AJ$93<>\"\",ROW(AJ$71:AJ$93)-ROW(AJ$71)+1,\"\"),$AS84))),\"\",INDEX(AJ$71:AJ$93,SMALL(IF(AJ$71:AJ$93<>\"\",ROW(AJ$71:AJ$93)-ROW(AJ$71)+1,\"\"),$AS84)))","v":""},{"$f":"IF(ISERROR(INDEX(AK$71:AK$93,SMALL(IF(AK$71:AK$93<>\"\",ROW(AK$71:AK$93)-ROW(AK$71)+1,\"\"),$AS84))),\"\",INDEX(AK$71:AK$93,SMALL(IF(AK$71:AK$93<>\"\",ROW(AK$71:AK$93)-ROW(AK$71)+1,\"\"),$AS84)))","v":""},{"$f":"IF(ISERROR(INDEX(AL$71:AL$93,SMALL(IF(AL$71:AL$93<>\"\",ROW(AL$71:AL$93)-ROW(AL$71)+1,\"\"),$AS84))),\"\",INDEX(AL$71:AL$93,SMALL(IF(AL$71:AL$93<>\"\",ROW(AL$71:AL$93)-ROW(AL$71)+1,\"\"),$AS84)))","v":""},{"$f":"IF(ISERROR(INDEX(AM$71:AM$93,SMALL(IF(AM$71:AM$93<>\"\",ROW(AM$71:AM$93)-ROW(AM$71)+1,\"\"),$AS84))),\"\",INDEX(AM$71:AM$93,SMALL(IF(AM$71:AM$93<>\"\",ROW(AM$71:AM$93)-ROW(AM$71)+1,\"\"),$AS84)))","v":""},{"$f":"IF(ISERROR(INDEX(AN$71:AN$93,SMALL(IF(AN$71:AN$93<>\"\",ROW(AN$71:AN$93)-ROW(AN$71)+1,\"\"),$AS84))),\"\",INDEX(AN$71:AN$93,SMALL(IF(AN$71:AN$93<>\"\",ROW(AN$71:AN$93)-ROW(AN$71)+1,\"\"),$AS84)))","v":""},{"$f":"IF(ISERROR(INDEX(AO$71:AO$93,SMALL(IF(AO$71:AO$93<>\"\",ROW(AO$71:AO$93)-ROW(AO$71)+1,\"\"),$AS84))),\"\",INDEX(AO$71:AO$93,SMALL(IF(AO$71:AO$93<>\"\",ROW(AO$71:AO$93)-ROW(AO$71)+1,\"\"),$AS84)))","v":""},{"$f":"IF(ISERROR(INDEX(AP$71:AP$93,SMALL(IF(AP$71:AP$93<>\"\",ROW(AP$71:AP$93)-ROW(AP$71)+1,\"\"),$AS84))),\"\",INDEX(AP$71:AP$93,SMALL(IF(AP$71:AP$93<>\"\",ROW(AP$71:AP$93)-ROW(AP$71)+1,\"\"),$AS84)))","v":""},{"$f":"IF(ISERROR(INDEX(AQ$71:AQ$93,SMALL(IF(AQ$71:AQ$93<>\"\",ROW(AQ$71:AQ$93)-ROW(AQ$71)+1,\"\"),$AS84))),\"\",INDEX(AQ$71:AQ$93,SMALL(IF(AQ$71:AQ$93<>\"\",ROW(AQ$71:AQ$93)-ROW(AQ$71)+1,\"\"),$AS84)))","v":""}]
["Investigation","d4-2","d4-2","d4-2","d4-2","d4-2","d4-2","d4-2","d4-2","d4-2","d4-2","d4-2","d4-2",null,null,"Investigation",0,0,0,0,0,0,0,0,0,0,0,0,null,null,"Investigation","","","","","","","","","","","","",null,14,"Investigation",{"$f":"IF(ISERROR(INDEX(AF$71:AF$93,SMALL(IF(AF$71:AF$93<>\"\",ROW(AF$71:AF$93)-ROW(AF$71)+1,\"\"),$AS85))),\"\",INDEX(AF$71:AF$93,SMALL(IF(AF$71:AF$93<>\"\",ROW(AF$71:AF$93)-ROW(AF$71)+1,\"\"),$AS85)))","v":""},{"$f":"IF(ISERROR(INDEX(AG$71:AG$93,SMALL(IF(AG$71:AG$93<>\"\",ROW(AG$71:AG$93)-ROW(AG$71)+1,\"\"),$AS85))),\"\",INDEX(AG$71:AG$93,SMALL(IF(AG$71:AG$93<>\"\",ROW(AG$71:AG$93)-ROW(AG$71)+1,\"\"),$AS85)))","v":""},{"$f":"IF(ISERROR(INDEX(AH$71:AH$93,SMALL(IF(AH$71:AH$93<>\"\",ROW(AH$71:AH$93)-ROW(AH$71)+1,\"\"),$AS85))),\"\",INDEX(AH$71:AH$93,SMALL(IF(AH$71:AH$93<>\"\",ROW(AH$71:AH$93)-ROW(AH$71)+1,\"\"),$AS85)))","v":""},{"$f":"IF(ISERROR(INDEX(AI$71:AI$93,SMALL(IF(AI$71:AI$93<>\"\",ROW(AI$71:AI$93)-ROW(AI$71)+1,\"\"),$AS85))),\"\",INDEX(AI$71:AI$93,SMALL(IF(AI$71:AI$93<>\"\",ROW(AI$71:AI$93)-ROW(AI$71)+1,\"\"),$AS85)))","v":""},{"$f":"IF(ISERROR(INDEX(AJ$71:AJ$93,SMALL(IF(AJ$71:AJ$93<>\"\",ROW(AJ$71:AJ$93)-ROW(AJ$71)+1,\"\"),$AS85))),\"\",INDEX(AJ$71:AJ$93,SMALL(IF(AJ$71:AJ$93<>\"\",ROW(AJ$71:AJ$93)-ROW(AJ$71)+1,\"\"),$AS85)))","v":""},{"$f":"IF(ISERROR(INDEX(AK$71:AK$93,SMALL(IF(AK$71:AK$93<>\"\",ROW(AK$71:AK$93)-ROW(AK$71)+1,\"\"),$AS85))),\"\",INDEX(AK$71:AK$93,SMALL(IF(AK$71:AK$93<>\"\",ROW(AK$71:AK$93)-ROW(AK$71)+1,\"\"),$AS85)))","v":""},{"$f":"IF(ISERROR(INDEX(AL$71:AL$93,SMALL(IF(AL$71:AL$93<>\"\",ROW(AL$71:AL$93)-ROW(AL$71)+1,\"\"),$AS85))),\"\",INDEX(AL$71:AL$93,SMALL(IF(AL$71:AL$93<>\"\",ROW(AL$71:AL$93)-ROW(AL$71)+1,\"\"),$AS85)))","v":""},{"$f":"IF(ISERROR(INDEX(AM$71:AM$93,SMALL(IF(AM$71:AM$93<>\"\",ROW(AM$71:AM$93)-ROW(AM$71)+1,\"\"),$AS85))),\"\",INDEX(AM$71:AM$93,SMALL(IF(AM$71:AM$93<>\"\",ROW(AM$71:AM$93)-ROW(AM$71)+1,\"\"),$AS85)))","v":""},{"$f":"IF(ISERROR(INDEX(AN$71:AN$93,SMALL(IF(AN$71:AN$93<>\"\",ROW(AN$71:AN$93)-ROW(AN$71)+1,\"\"),$AS85))),\"\",INDEX(AN$71:AN$93,SMALL(IF(AN$71:AN$93<>\"\",ROW(AN$71:AN$93)-ROW(AN$71)+1,\"\"),$AS85)))","v":""},{"$f":"IF(ISERROR(INDEX(AO$71:AO$93,SMALL(IF(AO$71:AO$93<>\"\",ROW(AO$71:AO$93)-ROW(AO$71)+1,\"\"),$AS85))),\"\",INDEX(AO$71:AO$93,SMALL(IF(AO$71:AO$93<>\"\",ROW(AO$71:AO$93)-ROW(AO$71)+1,\"\"),$AS85)))","v":""},{"$f":"IF(ISERROR(INDEX(AP$71:AP$93,SMALL(IF(AP$71:AP$93<>\"\",ROW(AP$71:AP$93)-ROW(AP$71)+1,\"\"),$AS85))),\"\",INDEX(AP$71:AP$93,SMALL(IF(AP$71:AP$93<>\"\",ROW(AP$71:AP$93)-ROW(AP$71)+1,\"\"),$AS85)))","v":""},{"$f":"IF(ISERROR(INDEX(AQ$71:AQ$93,SMALL(IF(AQ$71:AQ$93<>\"\",ROW(AQ$71:AQ$93)-ROW(AQ$71)+1,\"\"),$AS85))),\"\",INDEX(AQ$71:AQ$93,SMALL(IF(AQ$71:AQ$93<>\"\",ROW(AQ$71:AQ$93)-ROW(AQ$71)+1,\"\"),$AS85)))","v":""}]
["Lockpicking","d4-2","d4-2","d4-2","d4-2","d4-2","d4-2","d4-2","d4-2","d4-2","d4-2","d4-2","d4-2",null,null,"Lockpicking",0,0,0,0,0,0,0,0,0,0,0,0,null,null,"Lockpicking","","","","","","","","","","","","",null,15,"Lockpicking",{"$f":"IF(ISERROR(INDEX(AF$71:AF$93,SMALL(IF(AF$71:AF$93<>\"\",ROW(AF$71:AF$93)-ROW(AF$71)+1,\"\"),$AS86))),\"\",INDEX(AF$71:AF$93,SMALL(IF(AF$71:AF$93<>\"\",ROW(AF$71:AF$93)-ROW(AF$71)+1,\"\"),$AS86)))","v":""},{"$f":"IF(ISERROR(INDEX(AG$71:AG$93,SMALL(IF(AG$71:AG$93<>\"\",ROW(AG$71:AG$93)-ROW(AG$71)+1,\"\"),$AS86))),\"\",INDEX(AG$71:AG$93,SMALL(IF(AG$71:AG$93<>\"\",ROW(AG$71:AG$93)-ROW(AG$71)+1,\"\"),$AS86)))","v":""},{"$f":"IF(ISERROR(INDEX(AH$71:AH$93,SMALL(IF(AH$71:AH$93<>\"\",ROW(AH$71:AH$93)-ROW(AH$71)+1,\"\"),$AS86))),\"\",INDEX(AH$71:AH$93,SMALL(IF(AH$71:AH$93<>\"\",ROW(AH$71:AH$93)-ROW(AH$71)+1,\"\"),$AS86)))","v":""},{"$f":"IF(ISERROR(INDEX(AI$71:AI$93,SMALL(IF(AI$71:AI$93<>\"\",ROW(AI$71:AI$93)-ROW(AI$71)+1,\"\"),$AS86))),\"\",INDEX(AI$71:AI$93,SMALL(IF(AI$71:AI$93<>\"\",ROW(AI$71:AI$93)-ROW(AI$71)+1,\"\"),$AS86)))","v":""},{"$f":"IF(ISERROR(INDEX(AJ$71:AJ$93,SMALL(IF(AJ$71:AJ$93<>\"\",ROW(AJ$71:AJ$93)-ROW(AJ$71)+1,\"\"),$AS86))),\"\",INDEX(AJ$71:AJ$93,SMALL(IF(AJ$71:AJ$93<>\"\",ROW(AJ$71:AJ$93)-ROW(AJ$71)+1,\"\"),$AS86)))","v":""},{"$f":"IF(ISERROR(INDEX(AK$71:AK$93,SMALL(IF(AK$71:AK$93<>\"\",ROW(AK$71:AK$93)-ROW(AK$71)+1,\"\"),$AS86))),\"\",INDEX(AK$71:AK$93,SMALL(IF(AK$71:AK$93<>\"\",ROW(AK$71:AK$93)-ROW(AK$71)+1,\"\"),$AS86)))","v":""},{"$f":"IF(ISERROR(INDEX(AL$71:AL$93,SMALL(IF(AL$71:AL$93<>\"\",ROW(AL$71:AL$93)-ROW(AL$71)+1,\"\"),$AS86))),\"\",INDEX(AL$71:AL$93,SMALL(IF(AL$71:AL$93<>\"\",ROW(AL$71:AL$93)-ROW(AL$71)+1,\"\"),$AS86)))","v":""},{"$f":"IF(ISERROR(INDEX(AM$71:AM$93,SMALL(IF(AM$71:AM$93<>\"\",ROW(AM$71:AM$93)-ROW(AM$71)+1,\"\"),$AS86))),\"\",INDEX(AM$71:AM$93,SMALL(IF(AM$71:AM$93<>\"\",ROW(AM$71:AM$93)-ROW(AM$71)+1,\"\"),$AS86)))","v":""},{"$f":"IF(ISERROR(INDEX(AN$71:AN$93,SMALL(IF(AN$71:AN$93<>\"\",ROW(AN$71:AN$93)-ROW(AN$71)+1,\"\"),$AS86))),\"\",INDEX(AN$71:AN$93,SMALL(IF(AN$71:AN$93<>\"\",ROW(AN$71:AN$93)-ROW(AN$71)+1,\"\"),$AS86)))","v":""},{"$f":"IF(ISERROR(INDEX(AO$71:AO$93,SMALL(IF(AO$71:AO$93<>\"\",ROW(AO$71:AO$93)-ROW(AO$71)+1,\"\"),$AS86))),\"\",INDEX(AO$71:AO$93,SMALL(IF(AO$71:AO$93<>\"\",ROW(AO$71:AO$93)-ROW(AO$71)+1,\"\"),$AS86)))","v":""},{"$f":"IF(ISERROR(INDEX(AP$71:AP$93,SMALL(IF(AP$71:AP$93<>\"\",ROW(AP$71:AP$93)-ROW(AP$71)+1,\"\"),$AS86))),\"\",INDEX(AP$71:AP$93,SMALL(IF(AP$71:AP$93<>\"\",ROW(AP$71:AP$93)-ROW(AP$71)+1,\"\"),$AS86)))","v":""},{"$f":"IF(ISERROR(INDEX(AQ$71:AQ$93,SMALL(IF(AQ$71:AQ$93<>\"\",ROW(AQ$71:AQ$93)-ROW(AQ$71)+1,\"\"),$AS86))),\"\",INDEX(AQ$71:AQ$93,SMALL(IF(AQ$71:AQ$93<>\"\",ROW(AQ$71:AQ$93)-ROW(AQ$71)+1,\"\"),$AS86)))","v":""}]
["Persuasion","d4-2","d4-2","d4-2","d4-2","d4-2","d4-2","d4-2","d4-2","d4-2","d4-2","d4-2","d4-2",null,null,"Persuasion",0,0,0,0,0,0,0,0,0,0,0,0,null,null,"Persuasion","","","","","","","","","","","","",null,16,"Persuasion",{"$f":"IF(ISERROR(INDEX(AF$71:AF$93,SMALL(IF(AF$71:AF$93<>\"\",ROW(AF$71:AF$93)-ROW(AF$71)+1,\"\"),$AS87))),\"\",INDEX(AF$71:AF$93,SMALL(IF(AF$71:AF$93<>\"\",ROW(AF$71:AF$93)-ROW(AF$71)+1,\"\"),$AS87)))","v":""},{"$f":"IF(ISERROR(INDEX(AG$71:AG$93,SMALL(IF(AG$71:AG$93<>\"\",ROW(AG$71:AG$93)-ROW(AG$71)+1,\"\"),$AS87))),\"\",INDEX(AG$71:AG$93,SMALL(IF(AG$71:AG$93<>\"\",ROW(AG$71:AG$93)-ROW(AG$71)+1,\"\"),$AS87)))","v":""},{"$f":"IF(ISERROR(INDEX(AH$71:AH$93,SMALL(IF(AH$71:AH$93<>\"\",ROW(AH$71:AH$93)-ROW(AH$71)+1,\"\"),$AS87))),\"\",INDEX(AH$71:AH$93,SMALL(IF(AH$71:AH$93<>\"\",ROW(AH$71:AH$93)-ROW(AH$71)+1,\"\"),$AS87)))","v":""},{"$f":"IF(ISERROR(INDEX(AI$71:AI$93,SMALL(IF(AI$71:AI$93<>\"\",ROW(AI$71:AI$93)-ROW(AI$71)+1,\"\"),$AS87))),\"\",INDEX(AI$71:AI$93,SMALL(IF(AI$71:AI$93<>\"\",ROW(AI$71:AI$93)-ROW(AI$71)+1,\"\"),$AS87)))","v":""},{"$f":"IF(ISERROR(INDEX(AJ$71:AJ$93,SMALL(IF(AJ$71:AJ$93<>\"\",ROW(AJ$71:AJ$93)-ROW(AJ$71)+1,\"\"),$AS87))),\"\",INDEX(AJ$71:AJ$93,SMALL(IF(AJ$71:AJ$93<>\"\",ROW(AJ$71:AJ$93)-ROW(AJ$71)+1,\"\"),$AS87)))","v":""},{"$f":"IF(ISERROR(INDEX(AK$71:AK$93,SMALL(IF(AK$71:AK$93<>\"\",ROW(AK$71:AK$93)-ROW(AK$71)+1,\"\"),$AS87))),\"\",INDEX(AK$71:AK$93,SMALL(IF(AK$71:AK$93<>\"\",ROW(AK$71:AK$93)-ROW(AK$71)+1,\"\"),$AS87)))","v":""},{"$f":"IF(ISERROR(INDEX(AL$71:AL$93,SMALL(IF(AL$71:AL$93<>\"\",ROW(AL$71:AL$93)-ROW(AL$71)+1,\"\"),$AS87))),\"\",INDEX(AL$71:AL$93,SMALL(IF(AL$71:AL$93<>\"\",ROW(AL$71:AL$93)-ROW(AL$71)+1,\"\"),$AS87)))","v":""},{"$f":"IF(ISERROR(INDEX(AM$71:AM$93,SMALL(IF(AM$71:AM$93<>\"\",ROW(AM$71:AM$93)-ROW(AM$71)+1,\"\"),$AS87))),\"\",INDEX(AM$71:AM$93,SMALL(IF(AM$71:AM$93<>\"\",ROW(AM$71:AM$93)-ROW(AM$71)+1,\"\"),$AS87)))","v":""},{"$f":"IF(ISERROR(INDEX(AN$71:AN$93,SMALL(IF(AN$71:AN$93<>\"\",ROW(AN$71:AN$93)-ROW(AN$71)+1,\"\"),$AS87))),\"\",INDEX(AN$71:AN$93,SMALL(IF(AN$71:AN$93<>\"\",ROW(AN$71:AN$93)-ROW(AN$71)+1,\"\"),$AS87)))","v":""},{"$f":"IF(ISERROR(INDEX(AO$71:AO$93,SMALL(IF(AO$71:AO$93<>\"\",ROW(AO$71:AO$93)-ROW(AO$71)+1,\"\"),$AS87))),\"\",INDEX(AO$71:AO$93,SMALL(IF(AO$71:AO$93<>\"\",ROW(AO$71:AO$93)-ROW(AO$71)+1,\"\"),$AS87)))","v":""},{"$f":"IF(ISERROR(INDEX(AP$71:AP$93,SMALL(IF(AP$71:AP$93<>\"\",ROW(AP$71:AP$93)-ROW(AP$71)+1,\"\"),$AS87))),\"\",INDEX(AP$71:AP$93,SMALL(IF(AP$71:AP$93<>\"\",ROW(AP$71:AP$93)-ROW(AP$71)+1,\"\"),$AS87)))","v":""},{"$f":"IF(ISERROR(INDEX(AQ$71:AQ$93,SMALL(IF(AQ$71:AQ$93<>\"\",ROW(AQ$71:AQ$93)-ROW(AQ$71)+1,\"\"),$AS87))),\"\",INDEX(AQ$71:AQ$93,SMALL(IF(AQ$71:AQ$93<>\"\",ROW(AQ$71:AQ$93)-ROW(AQ$71)+1,\"\"),$AS87)))","v":""}]
["Piloting","d4-2","d4-2","d4-2","d4-2","d4-2","d4-2","d4-2","d4-2","d4-2","d4-2","d4-2","d4-2",null,null,"Piloting",0,0,0,0,0,0,0,0,0,0,0,0,null,null,"Piloting","","","","","","","","","","","","",null,17,"Piloting",{"$f":"IF(ISERROR(INDEX(AF$71:AF$93,SMALL(IF(AF$71:AF$93<>\"\",ROW(AF$71:AF$93)-ROW(AF$71)+1,\"\"),$AS88))),\"\",INDEX(AF$71:AF$93,SMALL(IF(AF$71:AF$93<>\"\",ROW(AF$71:AF$93)-ROW(AF$71)+1,\"\"),$AS88)))","v":""},{"$f":"IF(ISERROR(INDEX(AG$71:AG$93,SMALL(IF(AG$71:AG$93<>\"\",ROW(AG$71:AG$93)-ROW(AG$71)+1,\"\"),$AS88))),\"\",INDEX(AG$71:AG$93,SMALL(IF(AG$71:AG$93<>\"\",ROW(AG$71:AG$93)-ROW(AG$71)+1,\"\"),$AS88)))","v":""},{"$f":"IF(ISERROR(INDEX(AH$71:AH$93,SMALL(IF(AH$71:AH$93<>\"\",ROW(AH$71:AH$93)-ROW(AH$71)+1,\"\"),$AS88))),\"\",INDEX(AH$71:AH$93,SMALL(IF(AH$71:AH$93<>\"\",ROW(AH$71:AH$93)-ROW(AH$71)+1,\"\"),$AS88)))","v":""},{"$f":"IF(ISERROR(INDEX(AI$71:AI$93,SMALL(IF(AI$71:AI$93<>\"\",ROW(AI$71:AI$93)-ROW(AI$71)+1,\"\"),$AS88))),\"\",INDEX(AI$71:AI$93,SMALL(IF(AI$71:AI$93<>\"\",ROW(AI$71:AI$93)-ROW(AI$71)+1,\"\"),$AS88)))","v":""},{"$f":"IF(ISERROR(INDEX(AJ$71:AJ$93,SMALL(IF(AJ$71:AJ$93<>\"\",ROW(AJ$71:AJ$93)-ROW(AJ$71)+1,\"\"),$AS88))),\"\",INDEX(AJ$71:AJ$93,SMALL(IF(AJ$71:AJ$93<>\"\",ROW(AJ$71:AJ$93)-ROW(AJ$71)+1,\"\"),$AS88)))","v":""},{"$f":"IF(ISERROR(INDEX(AK$71:AK$93,SMALL(IF(AK$71:AK$93<>\"\",ROW(AK$71:AK$93)-ROW(AK$71)+1,\"\"),$AS88))),\"\",INDEX(AK$71:AK$93,SMALL(IF(AK$71:AK$93<>\"\",ROW(AK$71:AK$93)-ROW(AK$71)+1,\"\"),$AS88)))","v":""},{"$f":"IF(ISERROR(INDEX(AL$71:AL$93,SMALL(IF(AL$71:AL$93<>\"\",ROW(AL$71:AL$93)-ROW(AL$71)+1,\"\"),$AS88))),\"\",INDEX(AL$71:AL$93,SMALL(IF(AL$71:AL$93<>\"\",ROW(AL$71:AL$93)-ROW(AL$71)+1,\"\"),$AS88)))","v":""},{"$f":"IF(ISERROR(INDEX(AM$71:AM$93,SMALL(IF(AM$71:AM$93<>\"\",ROW(AM$71:AM$93)-ROW(AM$71)+1,\"\"),$AS88))),\"\",INDEX(AM$71:AM$93,SMALL(IF(AM$71:AM$93<>\"\",ROW(AM$71:AM$93)-ROW(AM$71)+1,\"\"),$AS88)))","v":""},{"$f":"IF(ISERROR(INDEX(AN$71:AN$93,SMALL(IF(AN$71:AN$93<>\"\",ROW(AN$71:AN$93)-ROW(AN$71)+1,\"\"),$AS88))),\"\",INDEX(AN$71:AN$93,SMALL(IF(AN$71:AN$93<>\"\",ROW(AN$71:AN$93)-ROW(AN$71)+1,\"\"),$AS88)))","v":""},{"$f":"IF(ISERROR(INDEX(AO$71:AO$93,SMALL(IF(AO$71:AO$93<>\"\",ROW(AO$71:AO$93)-ROW(AO$71)+1,\"\"),$AS88))),\"\",INDEX(AO$71:AO$93,SMALL(IF(AO$71:AO$93<>\"\",ROW(AO$71:AO$93)-ROW(AO$71)+1,\"\"),$AS88)))","v":""},{"$f":"IF(ISERROR(INDEX(AP$71:AP$93,SMALL(IF(AP$71:AP$93<>\"\",ROW(AP$71:AP$93)-ROW(AP$71)+1,\"\"),$AS88))),\"\",INDEX(AP$71:AP$93,SMALL(IF(AP$71:AP$93<>\"\",ROW(AP$71:AP$93)-ROW(AP$71)+1,\"\"),$AS88)))","v":""},{"$f":"IF(ISERROR(INDEX(AQ$71:AQ$93,SMALL(IF(AQ$71:AQ$93<>\"\",ROW(AQ$71:AQ$93)-ROW(AQ$71)+1,\"\"),$AS88))),\"\",INDEX(AQ$71:AQ$93,SMALL(IF(AQ$71:AQ$93<>\"\",ROW(AQ$71:AQ$93)-ROW(AQ$71)+1,\"\"),$AS88)))","v":""}]
["Repair","d4-2","d4-2","d4-2","d4-2","d4-2","d4-2","d4-2","d4-2","d4-2","d4-2","d4-2","d4-2",null,null,"Repair",0,0,0,0,0,0,0,0,0,0,0,0,null,null,"Repair","","","","","","","","","","","","",null,18,"Repair",{"$f":"IF(ISERROR(INDEX(AF$71:AF$93,SMALL(IF(AF$71:AF$93<>\"\",ROW(AF$71:AF$93)-ROW(AF$71)+1,\"\"),$AS89))),\"\",INDEX(AF$71:AF$93,SMALL(IF(AF$71:AF$93<>\"\",ROW(AF$71:AF$93)-ROW(AF$71)+1,\"\"),$AS89)))","v":""},{"$f":"IF(ISERROR(INDEX(AG$71:AG$93,SMALL(IF(AG$71:AG$93<>\"\",ROW(AG$71:AG$93)-ROW(AG$71)+1,\"\"),$AS89))),\"\",INDEX(AG$71:AG$93,SMALL(IF(AG$71:AG$93<>\"\",ROW(AG$71:AG$93)-ROW(AG$71)+1,\"\"),$AS89)))","v":""},{"$f":"IF(ISERROR(INDEX(AH$71:AH$93,SMALL(IF(AH$71:AH$93<>\"\",ROW(AH$71:AH$93)-ROW(AH$71)+1,\"\"),$AS89))),\"\",INDEX(AH$71:AH$93,SMALL(IF(AH$71:AH$93<>\"\",ROW(AH$71:AH$93)-ROW(AH$71)+1,\"\"),$AS89)))","v":""},{"$f":"IF(ISERROR(INDEX(AI$71:AI$93,SMALL(IF(AI$71:AI$93<>\"\",ROW(AI$71:AI$93)-ROW(AI$71)+1,\"\"),$AS89))),\"\",INDEX(AI$71:AI$93,SMALL(IF(AI$71:AI$93<>\"\",ROW(AI$71:AI$93)-ROW(AI$71)+1,\"\"),$AS89)))","v":""},{"$f":"IF(ISERROR(INDEX(AJ$71:AJ$93,SMALL(IF(AJ$71:AJ$93<>\"\",ROW(AJ$71:AJ$93)-ROW(AJ$71)+1,\"\"),$AS89))),\"\",INDEX(AJ$71:AJ$93,SMALL(IF(AJ$71:AJ$93<>\"\",ROW(AJ$71:AJ$93)-ROW(AJ$71)+1,\"\"),$AS89)))","v":""},{"$f":"IF(ISERROR(INDEX(AK$71:AK$93,SMALL(IF(AK$71:AK$93<>\"\",ROW(AK$71:AK$93)-ROW(AK$71)+1,\"\"),$AS89))),\"\",INDEX(AK$71:AK$93,SMALL(IF(AK$71:AK$93<>\"\",ROW(AK$71:AK$93)-ROW(AK$71)+1,\"\"),$AS89)))","v":""},{"$f":"IF(ISERROR(INDEX(AL$71:AL$93,SMALL(IF(AL$71:AL$93<>\"\",ROW(AL$71:AL$93)-ROW(AL$71)+1,\"\"),$AS89))),\"\",INDEX(AL$71:AL$93,SMALL(IF(AL$71:AL$93<>\"\",ROW(AL$71:AL$93)-ROW(AL$71)+1,\"\"),$AS89)))","v":""},{"$f":"IF(ISERROR(INDEX(AM$71:AM$93,SMALL(IF(AM$71:AM$93<>\"\",ROW(AM$71:AM$93)-ROW(AM$71)+1,\"\"),$AS89))),\"\",INDEX(AM$71:AM$93,SMALL(IF(AM$71:AM$93<>\"\",ROW(AM$71:AM$93)-ROW(AM$71)+1,\"\"),$AS89)))","v":""},{"$f":"IF(ISERROR(INDEX(AN$71:AN$93,SMALL(IF(AN$71:AN$93<>\"\",ROW(AN$71:AN$93)-ROW(AN$71)+1,\"\"),$AS89))),\"\",INDEX(AN$71:AN$93,SMALL(IF(AN$71:AN$93<>\"\",ROW(AN$71:AN$93)-ROW(AN$71)+1,\"\"),$AS89)))","v":""},{"$f":"IF(ISERROR(INDEX(AO$71:AO$93,SMALL(IF(AO$71:AO$93<>\"\",ROW(AO$71:AO$93)-ROW(AO$71)+1,\"\"),$AS89))),\"\",INDEX(AO$71:AO$93,SMALL(IF(AO$71:AO$93<>\"\",ROW(AO$71:AO$93)-ROW(AO$71)+1,\"\"),$AS89)))","v":""},{"$f":"IF(ISERROR(INDEX(AP$71:AP$93,SMALL(IF(AP$71:AP$93<>\"\",ROW(AP$71:AP$93)-ROW(AP$71)+1,\"\"),$AS89))),\"\",INDEX(AP$71:AP$93,SMALL(IF(AP$71:AP$93<>\"\",ROW(AP$71:AP$93)-ROW(AP$71)+1,\"\"),$AS89)))","v":""},{"$f":"IF(ISERROR(INDEX(AQ$71:AQ$93,SMALL(IF(AQ$71:AQ$93<>\"\",ROW(AQ$71:AQ$93)-ROW(AQ$71)+1,\"\"),$AS89))),\"\",INDEX(AQ$71:AQ$93,SMALL(IF(AQ$71:AQ$93<>\"\",ROW(AQ$71:AQ$93)-ROW(AQ$71)+1,\"\"),$AS89)))","v":""}]
["Streetwise","d4-2","d4-2","d4-2","d4-2","d4-2","d4-2","d4-2","d4-2","d4-2","d4-2","d4-2","d4-2",null,null,"Streetwise",0,0,0,0,0,0,0,0,0,0,0,0,null,null,"Streetwise","","","","","","","","","","","","",null,19,"Streetwise",{"$f":"IF(ISERROR(INDEX(AF$71:AF$93,SMALL(IF(AF$71:AF$93<>\"\",ROW(AF$71:AF$93)-ROW(AF$71)+1,\"\"),$AS90))),\"\",INDEX(AF$71:AF$93,SMALL(IF(AF$71:AF$93<>\"\",ROW(AF$71:AF$93)-ROW(AF$71)+1,\"\"),$AS90)))","v":""},{"$f":"IF(ISERROR(INDEX(AG$71:AG$93,SMALL(IF(AG$71:AG$93<>\"\",ROW(AG$71:AG$93)-ROW(AG$71)+1,\"\"),$AS90))),\"\",INDEX(AG$71:AG$93,SMALL(IF(AG$71:AG$93<>\"\",ROW(AG$71:AG$93)-ROW(AG$71)+1,\"\"),$AS90)))","v":""},{"$f":"IF(ISERROR(INDEX(AH$71:AH$93,SMALL(IF(AH$71:AH$93<>\"\",ROW(AH$71:AH$93)-ROW(AH$71)+1,\"\"),$AS90))),\"\",INDEX(AH$71:AH$93,SMALL(IF(AH$71:AH$93<>\"\",ROW(AH$71:AH$93)-ROW(AH$71)+1,\"\"),$AS90)))","v":""},{"$f":"IF(ISERROR(INDEX(AI$71:AI$93,SMALL(IF(AI$71:AI$93<>\"\",ROW(AI$71:AI$93)-ROW(AI$71)+1,\"\"),$AS90))),\"\",INDEX(AI$71:AI$93,SMALL(IF(AI$71:AI$93<>\"\",ROW(AI$71:AI$93)-ROW(AI$71)+1,\"\"),$AS90)))","v":""},{"$f":"IF(ISERROR(INDEX(AJ$71:AJ$93,SMALL(IF(AJ$71:AJ$93<>\"\",ROW(AJ$71:AJ$93)-ROW(AJ$71)+1,\"\"),$AS90))),\"\",INDEX(AJ$71:AJ$93,SMALL(IF(AJ$71:AJ$93<>\"\",ROW(AJ$71:AJ$93)-ROW(AJ$71)+1,\"\"),$AS90)))","v":""},{"$f":"IF(ISERROR(INDEX(AK$71:AK$93,SMALL(IF(AK$71:AK$93<>\"\",ROW(AK$71:AK$93)-ROW(AK$71)+1,\"\"),$AS90))),\"\",INDEX(AK$71:AK$93,SMALL(IF(AK$71:AK$93<>\"\",ROW(AK$71:AK$93)-ROW(AK$71)+1,\"\"),$AS90)))","v":""},{"$f":"IF(ISERROR(INDEX(AL$71:AL$93,SMALL(IF(AL$71:AL$93<>\"\",ROW(AL$71:AL$93)-ROW(AL$71)+1,\"\"),$AS90))),\"\",INDEX(AL$71:AL$93,SMALL(IF(AL$71:AL$93<>\"\",ROW(AL$71:AL$93)-ROW(AL$71)+1,\"\"),$AS90)))","v":""},{"$f":"IF(ISERROR(INDEX(AM$71:AM$93,SMALL(IF(AM$71:AM$93<>\"\",ROW(AM$71:AM$93)-ROW(AM$71)+1,\"\"),$AS90))),\"\",INDEX(AM$71:AM$93,SMALL(IF(AM$71:AM$93<>\"\",ROW(AM$71:AM$93)-ROW(AM$71)+1,\"\"),$AS90)))","v":""},{"$f":"IF(ISERROR(INDEX(AN$71:AN$93,SMALL(IF(AN$71:AN$93<>\"\",ROW(AN$71:AN$93)-ROW(AN$71)+1,\"\"),$AS90))),\"\",INDEX(AN$71:AN$93,SMALL(IF(AN$71:AN$93<>\"\",ROW(AN$71:AN$93)-ROW(AN$71)+1,\"\"),$AS90)))","v":""},{"$f":"IF(ISERROR(INDEX(AO$71:AO$93,SMALL(IF(AO$71:AO$93<>\"\",ROW(AO$71:AO$93)-ROW(AO$71)+1,\"\"),$AS90))),\"\",INDEX(AO$71:AO$93,SMALL(IF(AO$71:AO$93<>\"\",ROW(AO$71:AO$93)-ROW(AO$71)+1,\"\"),$AS90)))","v":""},{"$f":"IF(ISERROR(INDEX(AP$71:AP$93,SMALL(IF(AP$71:AP$93<>\"\",ROW(AP$71:AP$93)-ROW(AP$71)+1,\"\"),$AS90))),\"\",INDEX(AP$71:AP$93,SMALL(IF(AP$71:AP$93<>\"\",ROW(AP$71:AP$93)-ROW(AP$71)+1,\"\"),$AS90)))","v":""},{"$f":"IF(ISERROR(INDEX(AQ$71:AQ$93,SMALL(IF(AQ$71:AQ$93<>\"\",ROW(AQ$71:AQ$93)-ROW(AQ$71)+1,\"\"),$AS90))),\"\",INDEX(AQ$71:AQ$93,SMALL(IF(AQ$71:AQ$93<>\"\",ROW(AQ$71:AQ$93)-ROW(AQ$71)+1,\"\"),$AS90)))","v":""}]
["Survival","d4-2","d4-2","d4-2","d4-2","d4-2","d4-2","d4-2","d4-2","d4-2","d4-2","d4-2","d4-2",null,null,"Survival",0,0,0,0,0,0,0,0,0,0,0,0,null,null,"Survival","","","","","","","","","","","","",null,20,"Survival",{"$f":"IF(ISERROR(INDEX(AF$71:AF$93,SMALL(IF(AF$71:AF$93<>\"\",ROW(AF$71:AF$93)-ROW(AF$71)+1,\"\"),$AS91))),\"\",INDEX(AF$71:AF$93,SMALL(IF(AF$71:AF$93<>\"\",ROW(AF$71:AF$93)-ROW(AF$71)+1,\"\"),$AS91)))","v":""},{"$f":"IF(ISERROR(INDEX(AG$71:AG$93,SMALL(IF(AG$71:AG$93<>\"\",ROW(AG$71:AG$93)-ROW(AG$71)+1,\"\"),$AS91))),\"\",INDEX(AG$71:AG$93,SMALL(IF(AG$71:AG$93<>\"\",ROW(AG$71:AG$93)-ROW(AG$71)+1,\"\"),$AS91)))","v":""},{"$f":"IF(ISERROR(INDEX(AH$71:AH$93,SMALL(IF(AH$71:AH$93<>\"\",ROW(AH$71:AH$93)-ROW(AH$71)+1,\"\"),$AS91))),\"\",INDEX(AH$71:AH$93,SMALL(IF(AH$71:AH$93<>\"\",ROW(AH$71:AH$93)-ROW(AH$71)+1,\"\"),$AS91)))","v":""},{"$f":"IF(ISERROR(INDEX(AI$71:AI$93,SMALL(IF(AI$71:AI$93<>\"\",ROW(AI$71:AI$93)-ROW(AI$71)+1,\"\"),$AS91))),\"\",INDEX(AI$71:AI$93,SMALL(IF(AI$71:AI$93<>\"\",ROW(AI$71:AI$93)-ROW(AI$71)+1,\"\"),$AS91)))","v":""},{"$f":"IF(ISERROR(INDEX(AJ$71:AJ$93,SMALL(IF(AJ$71:AJ$93<>\"\",ROW(AJ$71:AJ$93)-ROW(AJ$71)+1,\"\"),$AS91))),\"\",INDEX(AJ$71:AJ$93,SMALL(IF(AJ$71:AJ$93<>\"\",ROW(AJ$71:AJ$93)-ROW(AJ$71)+1,\"\"),$AS91)))","v":""},{"$f":"IF(ISERROR(INDEX(AK$71:AK$93,SMALL(IF(AK$71:AK$93<>\"\",ROW(AK$71:AK$93)-ROW(AK$71)+1,\"\"),$AS91))),\"\",INDEX(AK$71:AK$93,SMALL(IF(AK$71:AK$93<>\"\",ROW(AK$71:AK$93)-ROW(AK$71)+1,\"\"),$AS91)))","v":""},{"$f":"IF(ISERROR(INDEX(AL$71:AL$93,SMALL(IF(AL$71:AL$93<>\"\",ROW(AL$71:AL$93)-ROW(AL$71)+1,\"\"),$AS91))),\"\",INDEX(AL$71:AL$93,SMALL(IF(AL$71:AL$93<>\"\",ROW(AL$71:AL$93)-ROW(AL$71)+1,\"\"),$AS91)))","v":""},{"$f":"IF(ISERROR(INDEX(AM$71:AM$93,SMALL(IF(AM$71:AM$93<>\"\",ROW(AM$71:AM$93)-ROW(AM$71)+1,\"\"),$AS91))),\"\",INDEX(AM$71:AM$93,SMALL(IF(AM$71:AM$93<>\"\",ROW(AM$71:AM$93)-ROW(AM$71)+1,\"\"),$AS91)))","v":""},{"$f":"IF(ISERROR(INDEX(AN$71:AN$93,SMALL(IF(AN$71:AN$93<>\"\",ROW(AN$71:AN$93)-ROW(AN$71)+1,\"\"),$AS91))),\"\",INDEX(AN$71:AN$93,SMALL(IF(AN$71:AN$93<>\"\",ROW(AN$71:AN$93)-ROW(AN$71)+1,\"\"),$AS91)))","v":""},{"$f":"IF(ISERROR(INDEX(AO$71:AO$93,SMALL(IF(AO$71:AO$93<>\"\",ROW(AO$71:AO$93)-ROW(AO$71)+1,\"\"),$AS91))),\"\",INDEX(AO$71:AO$93,SMALL(IF(AO$71:AO$93<>\"\",ROW(AO$71:AO$93)-ROW(AO$71)+1,\"\"),$AS91)))","v":""},{"$f":"IF(ISERROR(INDEX(AP$71:AP$93,SMALL(IF(AP$71:AP$93<>\"\",ROW(AP$71:AP$93)-ROW(AP$71)+1,\"\"),$AS91))),\"\",INDEX(AP$71:AP$93,SMALL(IF(AP$71:AP$93<>\"\",ROW(AP$71:AP$93)-ROW(AP$71)+1,\"\"),$AS91)))","v":""},{"$f":"IF(ISERROR(INDEX(AQ$71:AQ$93,SMALL(IF(AQ$71:AQ$93<>\"\",ROW(AQ$71:AQ$93)-ROW(AQ$71)+1,\"\"),$AS91))),\"\",INDEX(AQ$71:AQ$93,SMALL(IF(AQ$71:AQ$93<>\"\",ROW(AQ$71:AQ$93)-ROW(AQ$71)+1,\"\"),$AS91)))","v":""}]
["Swimming","d4-2","d4-2","d4-2","d4-2","d4-2","d4-2","d4-2","d4-2","d4-2","d4-2","d4-2","d4-2",null,null,"Swimming",0,0,0,0,0,0,0,0,0,0,0,0,null,null,"Swimming","","","","","","","","","","","","",null,21,"Swimming",{"$f":"IF(ISERROR(INDEX(AF$71:AF$93,SMALL(IF(AF$71:AF$93<>\"\",ROW(AF$71:AF$93)-ROW(AF$71)+1,\"\"),$AS92))),\"\",INDEX(AF$71:AF$93,SMALL(IF(AF$71:AF$93<>\"\",ROW(AF$71:AF$93)-ROW(AF$71)+1,\"\"),$AS92)))","v":""},{"$f":"IF(ISERROR(INDEX(AG$71:AG$93,SMALL(IF(AG$71:AG$93<>\"\",ROW(AG$71:AG$93)-ROW(AG$71)+1,\"\"),$AS92))),\"\",INDEX(AG$71:AG$93,SMALL(IF(AG$71:AG$93<>\"\",ROW(AG$71:AG$93)-ROW(AG$71)+1,\"\"),$AS92)))","v":""},{"$f":"IF(ISERROR(INDEX(AH$71:AH$93,SMALL(IF(AH$71:AH$93<>\"\",ROW(AH$71:AH$93)-ROW(AH$71)+1,\"\"),$AS92))),\"\",INDEX(AH$71:AH$93,SMALL(IF(AH$71:AH$93<>\"\",ROW(AH$71:AH$93)-ROW(AH$71)+1,\"\"),$AS92)))","v":""},{"$f":"IF(ISERROR(INDEX(AI$71:AI$93,SMALL(IF(AI$71:AI$93<>\"\",ROW(AI$71:AI$93)-ROW(AI$71)+1,\"\"),$AS92))),\"\",INDEX(AI$71:AI$93,SMALL(IF(AI$71:AI$93<>\"\",ROW(AI$71:AI$93)-ROW(AI$71)+1,\"\"),$AS92)))","v":""},{"$f":"IF(ISERROR(INDEX(AJ$71:AJ$93,SMALL(IF(AJ$71:AJ$93<>\"\",ROW(AJ$71:AJ$93)-ROW(AJ$71)+1,\"\"),$AS92))),\"\",INDEX(AJ$71:AJ$93,SMALL(IF(AJ$71:AJ$93<>\"\",ROW(AJ$71:AJ$93)-ROW(AJ$71)+1,\"\"),$AS92)))","v":""},{"$f":"IF(ISERROR(INDEX(AK$71:AK$93,SMALL(IF(AK$71:AK$93<>\"\",ROW(AK$71:AK$93)-ROW(AK$71)+1,\"\"),$AS92))),\"\",INDEX(AK$71:AK$93,SMALL(IF(AK$71:AK$93<>\"\",ROW(AK$71:AK$93)-ROW(AK$71)+1,\"\"),$AS92)))","v":""},{"$f":"IF(ISERROR(INDEX(AL$71:AL$93,SMALL(IF(AL$71:AL$93<>\"\",ROW(AL$71:AL$93)-ROW(AL$71)+1,\"\"),$AS92))),\"\",INDEX(AL$71:AL$93,SMALL(IF(AL$71:AL$93<>\"\",ROW(AL$71:AL$93)-ROW(AL$71)+1,\"\"),$AS92)))","v":""},{"$f":"IF(ISERROR(INDEX(AM$71:AM$93,SMALL(IF(AM$71:AM$93<>\"\",ROW(AM$71:AM$93)-ROW(AM$71)+1,\"\"),$AS92))),\"\",INDEX(AM$71:AM$93,SMALL(IF(AM$71:AM$93<>\"\",ROW(AM$71:AM$93)-ROW(AM$71)+1,\"\"),$AS92)))","v":""},{"$f":"IF(ISERROR(INDEX(AN$71:AN$93,SMALL(IF(AN$71:AN$93<>\"\",ROW(AN$71:AN$93)-ROW(AN$71)+1,\"\"),$AS92))),\"\",INDEX(AN$71:AN$93,SMALL(IF(AN$71:AN$93<>\"\",ROW(AN$71:AN$93)-ROW(AN$71)+1,\"\"),$AS92)))","v":""},{"$f":"IF(ISERROR(INDEX(AO$71:AO$93,SMALL(IF(AO$71:AO$93<>\"\",ROW(AO$71:AO$93)-ROW(AO$71)+1,\"\"),$AS92))),\"\",INDEX(AO$71:AO$93,SMALL(IF(AO$71:AO$93<>\"\",ROW(AO$71:AO$93)-ROW(AO$71)+1,\"\"),$AS92)))","v":""},{"$f":"IF(ISERROR(INDEX(AP$71:AP$93,SMALL(IF(AP$71:AP$93<>\"\",ROW(AP$71:AP$93)-ROW(AP$71)+1,\"\"),$AS92))),\"\",INDEX(AP$71:AP$93,SMALL(IF(AP$71:AP$93<>\"\",ROW(AP$71:AP$93)-ROW(AP$71)+1,\"\"),$AS92)))","v":""},{"$f":"IF(ISERROR(INDEX(AQ$71:AQ$93,SMALL(IF(AQ$71:AQ$93<>\"\",ROW(AQ$71:AQ$93)-ROW(AQ$71)+1,\"\"),$AS92))),\"\",INDEX(AQ$71:AQ$93,SMALL(IF(AQ$71:AQ$93<>\"\",ROW(AQ$71:AQ$93)-ROW(AQ$71)+1,\"\"),$AS92)))","v":""}]
["Tracking","d4-2","d4-2","d4-2","d4-2","d4-2","d4-2","d4-2","d4-2","d4-2","d4-2","d4-2","d4-2",null,null,"Tracking",0,0,0,0,0,0,0,0,0,0,0,0,null,null,"Tracking","","","","","","","","","","","","",null,22,"Tracking",{"$f":"IF(ISERROR(INDEX(AF$71:AF$93,SMALL(IF(AF$71:AF$93<>\"\",ROW(AF$71:AF$93)-ROW(AF$71)+1,\"\"),$AS93))),\"\",INDEX(AF$71:AF$93,SMALL(IF(AF$71:AF$93<>\"\",ROW(AF$71:AF$93)-ROW(AF$71)+1,\"\"),$AS93)))","v":""},{"$f":"IF(ISERROR(INDEX(AG$71:AG$93,SMALL(IF(AG$71:AG$93<>\"\",ROW(AG$71:AG$93)-ROW(AG$71)+1,\"\"),$AS93))),\"\",INDEX(AG$71:AG$93,SMALL(IF(AG$71:AG$93<>\"\",ROW(AG$71:AG$93)-ROW(AG$71)+1,\"\"),$AS93)))","v":""},{"$f":"IF(ISERROR(INDEX(AH$71:AH$93,SMALL(IF(AH$71:AH$93<>\"\",ROW(AH$71:AH$93)-ROW(AH$71)+1,\"\"),$AS93))),\"\",INDEX(AH$71:AH$93,SMALL(IF(AH$71:AH$93<>\"\",ROW(AH$71:AH$93)-ROW(AH$71)+1,\"\"),$AS93)))","v":""},{"$f":"IF(ISERROR(INDEX(AI$71:AI$93,SMALL(IF(AI$71:AI$93<>\"\",ROW(AI$71:AI$93)-ROW(AI$71)+1,\"\"),$AS93))),\"\",INDEX(AI$71:AI$93,SMALL(IF(AI$71:AI$93<>\"\",ROW(AI$71:AI$93)-ROW(AI$71)+1,\"\"),$AS93)))","v":""},{"$f":"IF(ISERROR(INDEX(AJ$71:AJ$93,SMALL(IF(AJ$71:AJ$93<>\"\",ROW(AJ$71:AJ$93)-ROW(AJ$71)+1,\"\"),$AS93))),\"\",INDEX(AJ$71:AJ$93,SMALL(IF(AJ$71:AJ$93<>\"\",ROW(AJ$71:AJ$93)-ROW(AJ$71)+1,\"\"),$AS93)))","v":""},{"$f":"IF(ISERROR(INDEX(AK$71:AK$93,SMALL(IF(AK$71:AK$93<>\"\",ROW(AK$71:AK$93)-ROW(AK$71)+1,\"\"),$AS93))),\"\",INDEX(AK$71:AK$93,SMALL(IF(AK$71:AK$93<>\"\",ROW(AK$71:AK$93)-ROW(AK$71)+1,\"\"),$AS93)))","v":""},{"$f":"IF(ISERROR(INDEX(AL$71:AL$93,SMALL(IF(AL$71:AL$93<>\"\",ROW(AL$71:AL$93)-ROW(AL$71)+1,\"\"),$AS93))),\"\",INDEX(AL$71:AL$93,SMALL(IF(AL$71:AL$93<>\"\",ROW(AL$71:AL$93)-ROW(AL$71)+1,\"\"),$AS93)))","v":""},{"$f":"IF(ISERROR(INDEX(AM$71:AM$93,SMALL(IF(AM$71:AM$93<>\"\",ROW(AM$71:AM$93)-ROW(AM$71)+1,\"\"),$AS93))),\"\",INDEX(AM$71:AM$93,SMALL(IF(AM$71:AM$93<>\"\",ROW(AM$71:AM$93)-ROW(AM$71)+1,\"\"),$AS93)))","v":""},{"$f":"IF(ISERROR(INDEX(AN$71:AN$93,SMALL(IF(AN$71:AN$93<>\"\",ROW(AN$71:AN$93)-ROW(AN$71)+1,\"\"),$AS93))),\"\",INDEX(AN$71:AN$93,SMALL(IF(AN$71:AN$93<>\"\",ROW(AN$71:AN$93)-ROW(AN$71)+1,\"\"),$AS93)))","v":""},{"$f":"IF(ISERROR(INDEX(AO$71:AO$93,SMALL(IF(AO$71:AO$93<>\"\",ROW(AO$71:AO$93)-ROW(AO$71)+1,\"\"),$AS93))),\"\",INDEX(AO$71:AO$93,SMALL(IF(AO$71:AO$93<>\"\",ROW(AO$71:AO$93)-ROW(AO$71)+1,\"\"),$AS93)))","v":""},{"$f":"IF(ISERROR(INDEX(AP$71:AP$93,SMALL(IF(AP$71:AP$93<>\"\",ROW(AP$71:AP$93)-ROW(AP$71)+1,\"\"),$AS93))),\"\",INDEX(AP$71:AP$93,SMALL(IF(AP$71:AP$93<>\"\",ROW(AP$71:AP$93)-ROW(AP$71)+1,\"\"),$AS93)))","v":""},{"$f":"IF(ISERROR(INDEX(AQ$71:AQ$93,SMALL(IF(AQ$71:AQ$93<>\"\",ROW(AQ$71:AQ$93)-ROW(AQ$71)+1,\"\"),$AS93))),\"\",INDEX(AQ$71:AQ$93,SMALL(IF(AQ$71:AQ$93<>\"\",ROW(AQ$71:AQ$93)-ROW(AQ$71)+1,\"\"),$AS93)))","v":""}]
[{"$nulls":30},"EDGES",{"$nulls":14},"EDGES",{"$f":"IF(COUNTBLANK(AU95:AU102)=8,\"\",MID(CONCATENATE(AU95,AU96,AU97,AU98,AU99,AU100,AU101,AU102),1,LEN(CONCATENATE(AU95,AU96,AU97,AU98,AU99,AU100,AU101,AU102))-2))","v":""},{"$f":"IF(COUNTBLANK(AV95:AV102)=8,\"\",MID(CONCATENATE(AV95,AV96,AV97,AV98,AV99,AV100,AV101,AV102),1,LEN(CONCATENATE(AV95,AV96,AV97,AV98,AV99,AV100,AV101,AV102))-2))","v":""},"","","","","","","","","",""]
["Base Edges",{"$f":"IF(OR(ISERROR(VLOOKUP($A95,RS_Roster,MATCH(B$51,RS_Roster_Position,0),FALSE)),VLOOKUP($A95,RS_Roster,MATCH(B$51,RS_Roster_Position,0),FALSE)=\"\"),\"\",VLOOKUP($A95,RS_Roster,MATCH(B$51,RS_Roster_Position,0),FALSE))","v":""},"","","","","","","","","","","",null,null,"Base Edges",{"$nulls":14},"Base Edges",{"$f":"IF(B95<>\"\",B95&\", \",\"\")","v":""},{"$f":"IF(C95<>\"\",C95&\", \",\"\")","v":""},{"$f":"IF(D95<>\"\",D95&\", \",\"\")","v":""},{"$f":"IF(E95<>\"\",E95&\", \",\"\")","v":""},{"$f":"IF(F95<>\"\",F95&\", \",\"\")","v":""},{"$f":"IF(G95<>\"\",G95&\", \",\"\")","v":""},{"$f":"IF(H95<>\"\",H95&\", \",\"\")","v":""},{"$f":"IF(I95<>\"\",I95&\", \",\"\")","v":""},{"$f":"IF(J95<>\"\",J95&\", \",\"\")","v":""},{"$f":"IF(K95<>\"\",K95&\", \",\"\")","v":""},{"$f":"IF(L95<>\"\",L95&\", \",\"\")","v":""},{"$f":"IF(M95<>\"\",M95&\", \",\"\")","v":""},null,null,"Base Edges",{"$f":"IF(AF95=\"\",\"\",AF95)","v":""},{"$f":"IF(AG95=\"\",\"\",AG95)","v":""},"","","","","","","","","",""]
["Additional Edge 1","","","","","","","","","","","","",null,null,"Additional Edge 1",{"$nulls":14},"Additional Edge 1",{"$f":"IF(B96<>\"\",B96&\", \",\"\")","v":""},"","","","","","","","","","","",null,null,"Additional Edge 1",{"$f":"IF(AF96=\"\",\"\",AF96)","v":""},"","","","","","","","","","",""]
["Additional Edge 2","","","","","","","","","","","","",null,null,"Additional Edge 2",{"$nulls":14},"Additional Edge 2","","","","","","","","","","","","",null,null,"Additional Edge 2","","","","","","","","","","","",""]
["Additional Edge 3","","","","","","","","","","","","",null,null,"Additional Edge 3",{"$nulls":14},"Additional Edge 3","","","","","","","","","","","","",null,null,"Additional Edge 3","","","","","","","","","","","",""]
["Additional Edge 4","","","","","","","","","","","","",null,null,"Additional Edge 4",{"$nulls":14},"Additional Edge 4","","","","","","","","","","","","",null,null,"Additional Edge 4","","","","","","","","","","","",""]
["Additional Edge 5","","","","","","","","","","","","",null,null,"Additional Edge 5",{"$nulls":14},"Additional Edge 5","","","","","","","","","","","","",null,null,"Additional Edge 5","","","","","","","","","","","",""]
["Additional Edge 6","","","","","","","","","","","","",null,null,"Additional Edge 6",{"$nulls":14},"Additional Edge 6","","","","","","","","","","","","",null,null,"Additional Edge 6","","","","","","","","","","","",""]
["Additional Edge 7","","","","","","","","","","","","",null,null,"Additional Edge 7",{"$nulls":14},"Additional Edge 7","","","","","","","","","","","","",null,null,"Additional Edge 7","","","","","","","","","","","",""]
["Notes","","","","","","","","","","","","",null,null,"Notes",{"$nulls":14},"Notes",{"$f":"B103","v":""},{"$f":"C103","v":""},"","","","","","","","","","",null,null,"Notes",{"$f":"IF(AU53<>\"\",IF(AU55=\"Y\",\"MERCENARY\"&CHAR(10),\"\")&\"Wounds (\"&AU57&IF(AU58<>0,\"), Bennies (\"&AU58&\")\",\")\")&IF(AF103<>\"\",CHAR(10)&AF103,\"\"),\"\")","v":""},{"$f":"IF(AV53<>\"\",IF(AV55=\"Y\",\"MERCENARY\"&CHAR(10),\"\")&\"Wounds (\"&AV57&IF(AV58<>0,\"), Bennies (\"&AV58&\")\",\")\")&IF(AG103<>\"\",CHAR(10)&AG103,\"\"),\"\")","v":""},"","","","","","","","","","",""]
["Base Gear","","","","","","","","","","","","",null,null,"Base Gear",{"$nulls":14},"Base Gear",{"$f":"B104","v":""},{"$f":"C104","v":""},{"$f":"D104","v":""},{"$f":"E104","v":""},{"$f":"F104","v":""},{"$f":"G104","v":""},{"$f":"H104","v":""},{"$f":"I104","v":""},{"$f":"J104","v":""},{"$f":"K104","v":""},{"$f":"L104","v":""},{"$f":"M104","v":""},null,null,"Base Gear","",{"$f":"IF(AG104=\"\",\"\",AG104)","v":""},"","","","","","","","","",""]
["Additional Gear","","","","","","","","","","","","",null,null,"Additional Gear",{"$nulls":14},"Additional Gear",{"$f":"B105","v":""},{"$f":"C105","v":""},{"$f":"D105","v":""},{"$f":"E105","v":""},{"$f":"F105","v":""},{"$f":"G105","v":""},{"$f":"H105","v":""},{"$f":"I105","v":""},{"$f":"J105","v":""},{"$f":"K105","v":""},{"$f":"L105","v":""},{"$f":"M105","v":""},null,null,"Additional Gear",{"$f":"IF(AF105=\"\",\"\",AF105)","v":""},{"$f":"IF(AG105=\"\",\"\",AG105)","v":""},{"$f":"IF(AH105=\"\",\"\",AH105)","v":""},{"$f":"IF(AI105=\"\",\"\",AI105)","v":""},{"$f":"IF(AJ105=\"\",\"\",AJ105)","v":""},{"$f":"IF(AK105=\"\",\"\",AK105)","v":""},{"$f":"IF(AL105=\"\",\"\",AL105)","v":""},{"$f":"IF(AM105=\"\",\"\",AM105)","v":""},{"$f":"IF(AN105=\"\",\"\",AN105)","v":""},{"$f":"IF(AO105=\"\",\"\",AO105)","v":""},{"$f":"IF(AP105=\"\",\"\",AP105)","v":""},{"$f":"IF(AQ105=\"\",\"\",AQ105)","v":""}]
["GEAR",{"$nulls":29},"GEAR",{"$f":"CONCATENATE(AF94,AF104,AF105)","v":""},{"$f":"CONCATENATE(AG94,AG104,AG105)","v":""},"","","","","","","","","","",null,null,"GEAR",{"$f":"CONCATENATE(IF(AU104<>\"\",AU104,\"\"),IF(AU105<>\"\",IF(AU104<>\"\",\", \"&AU105,AU105),\"\"))","v":""},{"$f":"CONCATENATE(IF(AV104<>\"\",AV104,\"\"),IF(AV105<>\"\",IF(AV104<>\"\",\", \"&AV105,AV105),\"\"))","v":""},"","","","","","","","","",""]
[]
["Edges","Source",null,"Assets","Max","Cost","Notes","Purchased","Mod. Cost",null,null,{"$f":"IF(COUNTBLANK(L109:L123)=15,\"\",MID(CONCATENATE(L109,L110,L111,L112,L113,L114,L115,L116,L117,L118,L119,L120,L121,L122,L123),1,LEN(CONCATENATE(L109,L110,L111,L112,L113,L114,L115,L116,L117,L118,L119,L120,L121,L122,L123))-2))","v":""}]
["Acrobat","SWD",null,"Agitator",5,1,"Hostile Asset",{"$f":"VLOOKUP(D109,Assets!$A$2:$D$16,MATCH(H$108,Assets!$A$1:$E$1,0),FALSE)","v":0},{"$f":"IF(H109>=E109,\"N/A\",F109+(H109*F109))","v":1},1,{"$f":"IF(H109<>0,D109&\" x \"&H109&\", \",\"\")","v":""},{"$f":"IF(ISERROR(INDEX(K108:K123,SMALL(IF(K108:K123<>\"\",ROW(K108:K123)-ROW(K108)+1,\"\"),$J109))),\"\",INDEX(K108:K123,SMALL(IF(K108:K123<>\"\",ROW(K108:K123)-ROW(K108)+1,\"\"),$J109)))","v":""}]
["Adept","SWD",null,"Augur",1,3,"Single use",{"$f":"VLOOKUP(D110,Assets!$A$2:$D$16,MATCH(H$108,Assets!$A$1:$E$1,0),FALSE)","v":0},{"$f":"IF(H110>=E110,\"N/A\",E110)","v":1},2,{"$f":"IF(H110<>0,D110&\" x \"&H110&\", \",\"\")","v":""},{"$f":"IF(ISERROR(INDEX(K109:K124,SMALL(IF(K109:K124<>\"\",ROW(K109:K124)-ROW(K109)+1,\"\"),$J110))),\"\",INDEX(K109:K124,SMALL(IF(K109:K124<>\"\",ROW(K109:K124)-ROW(K109)+1,\"\"),$J110)))","v":""}]
["Alertness","SWD",null,"Assassin",1,4,"Hostile Asset",{"$f":"VLOOKUP(D111,Assets!$A$2:$D$16,MATCH(H$108,Assets!$A$1:$E$1,0),FALSE)","v":0},{"$f":"IF(H111>=E111,\"N/A\",E111)","v":1},3,"",{"$f":"IF(ISERROR(INDEX(K110:K125,SMALL(IF(K110:K125<>\"\",ROW(K110:K125)-ROW(K110)+1,\"\"),$J111))),\"\",INDEX(K110:K125,SMALL(IF(K110:K125<>\"\",ROW(K110:K125)-ROW(K110)+1,\"\"),$J111)))","v":""}]
["Ambidextrous","SWD",null,"Courtesan",2,2,"Hostile Asset",{"$f":"VLOOKUP(D112,Assets!$A$2:$D$16,MATCH(H$108,Assets!$A$1:$E$1,0),FALSE)","v":0},2,4,"",{"$f":"IF(ISERROR(INDEX(K111:K126,SMALL(IF(K111:K126<>\"\",ROW(K111:K126)-ROW(K111)+1,\"\"),$J112))),\"\",INDEX(K111:K126,SMALL(IF(K111:K126<>\"\",ROW(K111:K126)-ROW(K111)+1,\"\"),$J112)))","v":""}]
["Arcane Resistance","SWD",null,"Excellent Weapon/Armor",2,2,"Item",{"$f":"VLOOKUP(D113,Assets!$A$2:$D$16,MATCH(H$108,Assets!$A$1:$E$1,0),FALSE)","v":0},2,5,"",{"$f":"IF(ISERROR(INDEX(K112:K127,SMALL(IF(K112:K127<>\"\",ROW(K112:K127)-ROW(K112)+1,\"\"),$J113))),\"\",INDEX(K112:K127,SMALL(IF(K112:K127<>\"\",ROW(K112:K127)-ROW(K112)+1,\"\"),$J113)))","v":""}]
["Assassin","SWD",null,"Guard",5,1,null,{"$f":"VLOOKUP(D114,Assets!$A$2:$D$16,MATCH(H$108,Assets!$A$1:$E$1,0),FALSE)","v":0},5,6,"",{"$f":"IF(ISERROR(INDEX(K113:K128,SMALL(IF(K113:K128<>\"\",ROW(K113:K128)-ROW(K113)+1,\"\"),$J114))),\"\",INDEX(K113:K128,SMALL(IF(K113:K128<>\"\",ROW(K113:K128)-ROW(K113)+1,\"\"),$J114)))","v":""}]
["Attractive","SWD",null,"Guard Captain",1,3,null,{"$f":"VLOOKUP(D115,Assets!$A$2:$D$16,MATCH(H$108,Assets!$A$1:$E$1,0),FALSE)","v":0},1,7,"",{"$f":"IF(ISERROR(INDEX(K114:K129,SMALL(IF(K114:K129<>\"\",ROW(K114:K129)-ROW(K114)+1,\"\"),$J115))),\"\",INDEX(K114:K129,SMALL(IF(K114:K129<>\"\",ROW(K114:K129)-ROW(K114)+1,\"\"),$J115)))","v":""}]
["Beast Bond","SWD",null,"Healer",2,2,null,{"$f":"VLOOKUP(D116,Assets!$A$2:$D$16,MATCH(H$108,Assets!$A$1:$E$1,0),FALSE)","v":0},2,8,"",{"$f":"IF(ISERROR(INDEX(K115:K130,SMALL(IF(K115:K130<>\"\",ROW(K115:K130)-ROW(K115)+1,\"\"),$J116))),\"\",INDEX(K115:K130,SMALL(IF(K115:K130<>\"\",ROW(K115:K130)-ROW(K115)+1,\"\"),$J116)))","v":""}]
["Beast Master","SWD",null,"Lanista",2,3,null,{"$f":"VLOOKUP(D117,Assets!$A$2:$D$16,MATCH(H$108,Assets!$A$1:$E$1,0),FALSE)","v":0},2,9,"",{"$f":"IF(ISERROR(INDEX(K116:K131,SMALL(IF(K116:K131<>\"\",ROW(K116:K131)-ROW(K116)+1,\"\"),$J117))),\"\",INDEX(K116:K131,SMALL(IF(K116:K131<>\"\",ROW(K116:K131)-ROW(K116)+1,\"\"),$J117)))","v":""}]
["Berserk","SWD",null,"Lotusmaster",1,3,null,{"$f":"VLOOKUP(D118,Assets!$A$2:$D$16,MATCH(H$108,Assets!$A$1:$E$1,0),FALSE)","v":0},1,10,"",{"$f":"IF(ISERROR(INDEX(K117:K132,SMALL(IF(K117:K132<>\"\",ROW(K117:K132)-ROW(K117)+1,\"\"),$J118))),\"\",INDEX(K117:K132,SMALL(IF(K117:K132<>\"\",ROW(K117:K132)-ROW(K117)+1,\"\"),$J118)))","v":""}]
["Block","SWD",null,"Match-Fixer",2,3,"Single use",{"$f":"VLOOKUP(D119,Assets!$A$2:$D$16,MATCH(H$108,Assets!$A$1:$E$1,0),FALSE)","v":0},2,11,"",{"$f":"IF(ISERROR(INDEX(K118:K133,SMALL(IF(K118:K133<>\"\",ROW(K118:K133)-ROW(K118)+1,\"\"),$J119))),\"\",INDEX(K118:K133,SMALL(IF(K118:K133<>\"\",ROW(K118:K133)-ROW(K118)+1,\"\"),$J119)))","v":""}]
["Brave","SWD",null,"Mercenary",2,"Variable - See Roster","Single use",{"$f":"VLOOKUP(D120,Assets!$A$2:$D$16,MATCH(H$108,Assets!$A$1:$E$1,0),FALSE)","v":0},"Variable - See Roster",12,"",{"$f":"IF(ISERROR(INDEX(K119:K134,SMALL(IF(K119:K134<>\"\",ROW(K119:K134)-ROW(K119)+1,\"\"),$J120))),\"\",INDEX(K119:K134,SMALL(IF(K119:K134<>\"\",ROW(K119:K134)-ROW(K119)+1,\"\"),$J120)))","v":""}]
["Brawler","SWD",null,"Poisoner",1,3,"Hostile Asset",{"$f":"VLOOKUP(D121,Assets!$A$2:$D$16,MATCH(H$108,Assets!$A$1:$E$1,0),FALSE)","v":0},{"$f":"F121","v":3},13,"",{"$f":"IF(ISERROR(INDEX(K120:K135,SMALL(IF(K120:K135<>\"\",ROW(K120:K135)-ROW(K120)+1,\"\"),$J121))),\"\",INDEX(K120:K135,SMALL(IF(K120:K135<>\"\",ROW(K120:K135)-ROW(K120)+1,\"\"),$J121)))","v":""}]
["Brawny","SWD",null,"Spy",1,2,"Hostile Asset",{"$f":"VLOOKUP(D122,Assets!$A$2:$D$16,MATCH(H$108,Assets!$A$1:$E$1,0),FALSE)","v":0},2,14,"",{"$f":"IF(ISERROR(INDEX(K121:K136,SMALL(IF(K121:K136<>\"\",ROW(K121:K136)-ROW(K121)+1,\"\"),$J122))),\"\",INDEX(K121:K136,SMALL(IF(K121:K136<>\"\",ROW(K121:K136)-ROW(K121)+1,\"\"),$J122)))","v":""}]
["Bruiser","SWD",null,"Warlock",1,4,"Hostile Asset",{"$f":"VLOOKUP(D123,Assets!$A$2:$D$16,MATCH(H$108,Assets!$A$1:$E$1,0),FALSE)","v":0},4,15,"",{"$f":"IF(ISERROR(INDEX(K122:K137,SMALL(IF(K122:K137<>\"\",ROW(K122:K137)-ROW(K122)+1,\"\"),$J123))),\"\",INDEX(K122:K137,SMALL(IF(K122:K137<>\"\",ROW(K122:K137)-ROW(K122)+1,\"\"),$J123)))","v":""}]
["Champion","SWD"]
["Charismatic","SWD"]
["Combat Reflexes","SWD"]
["Command","SWD"]
["Command Presence","SWD"]
["Common Bond","SWD"]
["Connections","SWD"]
["Counterattack","SWD"]
["Danger Sense","SWD"]
["Dead Shot","SWD"]
["Dodge","SWD"]
["Elan","SWD"]
["Expert","SWD"]
["Extraction","SWD"]
["Faith","SWD"]
["Fast Healer","SWD"]
["Fervor","SWD"]
["Filthy Rich","SWD"]
["First Strike","SWD"]
["Fleet-Footed","SWD"]
["Florentine","SWD"]
["Followers","SWD"]
["Frenzy","SWD"]
["Giant Killer","SWD"]
["Great Luck","SWD"]
["Hard to Kill","SWD"]
["Harder to Kill","SWD"]
["Healer","SWD"]
["Hold the Line!","SWD"]
["Holy/Unholy Warrior","SWD"]
["Imp. Arcane Res","SWD"]
["Imp. First Strike","SWD"]
["Imp. Frenzy","SWD"]
["Imp. Level Headed","SWD"]
["Imp. Nerves of Steel","SWD"]
["Imp. Sweep","SWD"]
["Imp. Tough as Nails","SWD"]
["Imp. Tr. Weapon","SWD"]
["Improved Block","SWD"]
["Improved Counterattack","SWD"]
["Improved Dodge","SWD"]
["Improved Extraction","SWD"]
["Improved Martial Artist","SWD"]
["Improvisational Fighter","SWD"]
["Inspire","SWD"]
["Investigator","SWD"]
["Jack-of-All-Trades","SWD"]
["Killer Instinct","SWD"]
["Leader of Men","SWD"]
["Level Headed","SWD"]
["Linguist","SWD"]
["Liquid Courage","SWD"]
["Luck","SWD"]
["Marksman","SWD"]
["Martial Artist","SWD"]
["Martial Arts Master","SWD"]
["Master","SWD"]
["Master of Arms","SWD"]
["Mighty Blow","SWD"]
["Natural Leader","SWD"]
["Nerves of Steel","SWD"]
["No Mercy","SWD"]
["Noble","SWD"]
["Professional","SWD"]
["Quick","SWD"]
["Quick Draw","SWD"]
["Rich","SWD"]
["Rock and Roll!","SWD"]
["Scavenger","SWD"]
["Scholar","SWD"]
["Sidekick","SWD"]
["Soul Drain","SWD"]
["Steady Hands","SWD"]
["Strong Willed","SWD"]
["Sweep","SWD"]
["Tactician","SWD"]
["Thief","SWD"]
["Tough as Nails","SWD"]
["Trademark Weapon","SWD"]
["Two-Fisted","SWD"]
["Very Attractive","SWD"]
["Weapon Master","SWD"]
["Woodsman","SWD"]
["Beat Back","CoJ"]
["Beggar's Gift","CoJ"]
["Cat Burglar","CoJ"]
["Cloak Hero/Heroine","CoJ"]
["Cloak Master/Mistress","CoJ"]
["Falcolner","CoJ"]
["Harass","CoJ"]
["Jan Tong Tattoo","CoJ"]
["Master of Disguise","CoJ"]
["Night Eyes","CoJ"]
["Nimble Strike","CoJ"]
["Poet","CoJ"]
["Rain of Steel","CoJ"]
["Still Got One","CoJ"]
["Street Rat","CoJ"]
["Amazon","GE"]
["Armor Use","GE"]
["Born in the Saddle","GE"]
["Brute","GE"]
["Buffalo Rider","GE"]
["Charioteer","GE"]
["Dancing Witch/Warlock","GE"]
["Distract","GE"]
["Fallen Noble","GE"]
["Ghoulblood","GE"]
["Gladiator, Former","GE"]
["Helper","GE"]
["Hoplite Training","GE"]
["Loincloth God","GE"]
["Loincloth Hero","GE"]
["Monk","GE"]
["One Hand and a Half","GE"]
["Poisoner","GE"]
["Priest/Philosopher","GE"]
["Quartermaster","GE"]
["Sage","GE"]
["Savage","GE"]
["Strong Arm","GE"]
["Temptress","GE"]
["Tooth and Nail","GE"]
["Trained Thrower","GE"]
["Treasure Hunter","GE"]
["Watch your Back!","GE"]
["Born in the Pits","GloD"]
["Burned Hand of Tosar","GloD"]
["Count the Deaths!","GloD"]
["Death Grip","GloD"]
["Gentle Touch","GloD"]
["Gladiator, Beast Warrior","GloD"]
["Gladiator, Bestiarius","GloD"]
["Gladiator, Bull Dancer","GloD"]
["Gladiator, Caldeian Fencer","GloD"]
["Gladiator, Caled Spearman","GloD"]
["Gladiator, Cavalryman","GloD"]
["Gladiator, Chain fighter","GloD"]
["Gladiator, Disk Fighter","GloD"]
["Gladiator, Myrmidon","GloD"]
["Gladiator, Pugilist","GloD"]
["Gladiator, Retiarius","GloD"]
["Gladiator, Skirmisher","GloD"]
["Gladiator, Spear Runner","GloD"]
["Gladiator, Swordsman","GloD"]
["Gladiator, Tusk Fighter","GloD"]
["Gladiator, Twin Master","GloD"]
["Gory Fighter","GloD"]
["Hero of the Pits","GloD"]
["Pit Trained","GloD"]
["Shaft Master","GloD"]
["Shield Warrior","GloD"]
["Soul Eater","GloD"]
["Arcane Background","Generic"]
["New Power","Generic"]
["Power Edge","Generic"]